{"text_format":"1","workbook":"xlsx","n_sheets":14,"sheets":["Instructions","Vue globale","P1","P2","P3","P4","P5","P6","P7","P8","P9","P10","P11","P12"],"not_rendered":{"charts":0,"images":3,"macros":1,"external_links":0,"defined_names":15,"comments":0,"pivot_tables":0},"unopened":[],"bounds":{"document_bytes":16777216,"sheet_cells":100000,"rows_first":2000,"rows_last":500,"rows_between":2000,"halvings":0,"cell_chars":16384,"cell_head_chars":4096},"cells_cut":0,"cells_raw":0,"read":"whole","date_system":"1900"}

{"sheet":"Instructions","index":0,"n_rows":8,"n_cols":2,"rows_kept":8,"cut":false,"hidden":false,"merged":[]}
[]
[null,"Matrice CPT organisationnelle - Instructions"]
[null,"Cet instrument permet de concentrer au même endroit les réponses d'une équipe de jusqu'à 12 personnes, en relation aux activités de l'organisation, d'est-à-dire en les classant dans les quatre quadrants de la matrice CPT :\n\n1) Confort :         J'ai la compétence pour l'activité et j'aime la réaliser ;\n1) Inconfort :      J'ai la compétence pour l'activité mais je n'aime pas la réaliser ;\n1) Attraction :     Je n'ai pas la compétence pour l'activité mais j'ai envie d'apprendre à  la réaliser ;\n1) Résignation :  Je n'ai pas la compétence pour l'activité et je n'aime pas la réaliser.\n\nLes activités sont celles définies dans le \"Référentiel de compétences organisationnelles et entrepreneuriales - V3.1\" de My-SBM, co-créé avec plus de 100 autres personnes."]
[]
[null,"Chaque membre de l'équipe peut se voir attribuer un des onglets, de P1 à P12 et ensuite indiquer pour chaque activité du tableau son ressenti : Confort, Inconfort, Attraction ou Résignation."]
[null,"L'onglet \"Vue globale\" reprend toutes les informations des onglets P1 à P12. Les boutons permettent alors de \"jouer\" avec le nuage des choix, effectués en fonction des activités, et d'utiliser ces vues pour distribuer les activités de la manière la plus équitable et performante au sein de l'équipe ou de l'organisation. Les cellules de l'attribution peuvent être formatées, même en étant protégées."]
[null,"La liste des activités peut être redéfinie dans la vue globale, avec un maximum de 100 activités. Les modifications se répercutent automatiquement sur les onglets P1 à P12."]
[null,"Pour éviter les surécritures accidentelles, tous les onglets sont protégés, mais sans mot de passe."]

{"sheet":"Vue globale","index":1,"n_rows":102,"n_cols":13,"rows_kept":102,"cut":false,"hidden":false,"merged":[[0,0,0,9]]}
["Instructions :\n - Ce tableau récupère les choix faits par un maximum de 12 personnes en relation à leur posture (compétence et préférence) de leur propre ressenti ;\n - Utilise les boutons pour tout montrer ou cacher, ou ne montrer que les choix d'un des quadrants de la matrice CPT ;\n - Les lignes des titres des blocs d'activités sont peut-être vides, car elles sont optionnelles ;\n - Efface les données exemple sur les onglets P1, P2 et P3."]
["Activités",{"$f":"'P1'!B2","v":"Anne"},{"$f":"'P2'!B2","v":"Jean"},{"$f":"'P3'!B2","v":"Dominique"},{"$f":"'P4'!B2","v":"P4"},{"$f":"'P5'!B2","v":"P5"},{"$f":"'P6'!B2","v":"P6"},{"$f":"'P7'!B2","v":"P7"},{"$f":"'P8'!B2","v":"P8"},{"$f":"'P9'!B2","v":"P9"},{"$f":"'P10'!B2","v":"P10"},{"$f":"'P11'!B2","v":"P11"},{"$f":"'P12'!B2","v":"P12"}]
["1. Conception et modélisation d’opportunités entrepreneuriales",{"$f":"IF('P1'!B4=\"\",\"\",'P1'!B4)","v":""},{"$f":"IF('P2'!B4=\"\",\"\",'P2'!B4)","v":""},{"$f":"IF('P3'!B4=\"\",\"\",'P3'!B4)","v":""},{"$f":"IF('P4'!B4=\"\",\"\",'P4'!B4)","v":""},{"$f":"IF('P5'!B4=\"\",\"\",'P5'!B4)","v":""},{"$f":"IF('P6'!B4=\"\",\"\",'P6'!B4)","v":""},{"$f":"IF('P7'!B4=\"\",\"\",'P7'!B4)","v":""},{"$f":"IF('P8'!B4=\"\",\"\",'P8'!B4)","v":""},{"$f":"IF('P9'!B4=\"\",\"\",'P9'!B4)","v":""},{"$f":"IF('P10'!B4=\"\",\"\",'P10'!B4)","v":""},{"$f":"IF('P11'!B4=\"\",\"\",'P11'!B4)","v":""},{"$f":"IF('P12'!B4=\"\",\"\",'P12'!B4)","v":""}]
["Connaissance de l’environnement ",{"$f":"IF('P1'!B5=\"\",\"\",'P1'!B5)","v":"Confort"},{"$f":"IF('P2'!B5=\"\",\"\",'P2'!B5)","v":"Résignation"},{"$f":"IF('P3'!B5=\"\",\"\",'P3'!B5)","v":"Inconfort"},{"$f":"IF('P4'!B5=\"\",\"\",'P4'!B5)","v":""},{"$f":"IF('P5'!B5=\"\",\"\",'P5'!B5)","v":""},{"$f":"IF('P6'!B5=\"\",\"\",'P6'!B5)","v":""},{"$f":"IF('P7'!B5=\"\",\"\",'P7'!B5)","v":""},{"$f":"IF('P8'!B5=\"\",\"\",'P8'!B5)","v":""},{"$f":"IF('P9'!B5=\"\",\"\",'P9'!B5)","v":""},{"$f":"IF('P10'!B5=\"\",\"\",'P10'!B5)","v":""},{"$f":"IF('P11'!B5=\"\",\"\",'P11'!B5)","v":""},{"$f":"IF('P12'!B5=\"\",\"\",'P12'!B5)","v":""}]
["Recherche d’opportunités ",{"$f":"IF('P1'!B6=\"\",\"\",'P1'!B6)","v":"Confort"},{"$f":"IF('P2'!B6=\"\",\"\",'P2'!B6)","v":"Résignation"},{"$f":"IF('P3'!B6=\"\",\"\",'P3'!B6)","v":"Attraction"},{"$f":"IF('P4'!B6=\"\",\"\",'P4'!B6)","v":""},{"$f":"IF('P5'!B6=\"\",\"\",'P5'!B6)","v":""},{"$f":"IF('P6'!B6=\"\",\"\",'P6'!B6)","v":""},{"$f":"IF('P7'!B6=\"\",\"\",'P7'!B6)","v":""},{"$f":"IF('P8'!B6=\"\",\"\",'P8'!B6)","v":""},{"$f":"IF('P9'!B6=\"\",\"\",'P9'!B6)","v":""},{"$f":"IF('P10'!B6=\"\",\"\",'P10'!B6)","v":""},{"$f":"IF('P11'!B6=\"\",\"\",'P11'!B6)","v":""},{"$f":"IF('P12'!B6=\"\",\"\",'P12'!B6)","v":""}]
["Mission et vision ",{"$f":"IF('P1'!B7=\"\",\"\",'P1'!B7)","v":"Confort"},{"$f":"IF('P2'!B7=\"\",\"\",'P2'!B7)","v":"Résignation"},{"$f":"IF('P3'!B7=\"\",\"\",'P3'!B7)","v":"Attraction"},{"$f":"IF('P4'!B7=\"\",\"\",'P4'!B7)","v":""},{"$f":"IF('P5'!B7=\"\",\"\",'P5'!B7)","v":""},{"$f":"IF('P6'!B7=\"\",\"\",'P6'!B7)","v":""},{"$f":"IF('P7'!B7=\"\",\"\",'P7'!B7)","v":""},{"$f":"IF('P8'!B7=\"\",\"\",'P8'!B7)","v":""},{"$f":"IF('P9'!B7=\"\",\"\",'P9'!B7)","v":""},{"$f":"IF('P10'!B7=\"\",\"\",'P10'!B7)","v":""},{"$f":"IF('P11'!B7=\"\",\"\",'P11'!B7)","v":""},{"$f":"IF('P12'!B7=\"\",\"\",'P12'!B7)","v":""}]
["Business model ",{"$f":"IF('P1'!B8=\"\",\"\",'P1'!B8)","v":"Confort"},{"$f":"IF('P2'!B8=\"\",\"\",'P2'!B8)","v":"Inconfort"},{"$f":"IF('P3'!B8=\"\",\"\",'P3'!B8)","v":"Attraction"},{"$f":"IF('P4'!B8=\"\",\"\",'P4'!B8)","v":""},{"$f":"IF('P5'!B8=\"\",\"\",'P5'!B8)","v":""},{"$f":"IF('P6'!B8=\"\",\"\",'P6'!B8)","v":""},{"$f":"IF('P7'!B8=\"\",\"\",'P7'!B8)","v":""},{"$f":"IF('P8'!B8=\"\",\"\",'P8'!B8)","v":""},{"$f":"IF('P9'!B8=\"\",\"\",'P9'!B8)","v":""},{"$f":"IF('P10'!B8=\"\",\"\",'P10'!B8)","v":""},{"$f":"IF('P11'!B8=\"\",\"\",'P11'!B8)","v":""},{"$f":"IF('P12'!B8=\"\",\"\",'P12'!B8)","v":""}]
["Evaluation commerciale ",{"$f":"IF('P1'!B9=\"\",\"\",'P1'!B9)","v":"Inconfort"},{"$f":"IF('P2'!B9=\"\",\"\",'P2'!B9)","v":"Résignation"},{"$f":"IF('P3'!B9=\"\",\"\",'P3'!B9)","v":"Attraction"},{"$f":"IF('P4'!B9=\"\",\"\",'P4'!B9)","v":""},{"$f":"IF('P5'!B9=\"\",\"\",'P5'!B9)","v":""},{"$f":"IF('P6'!B9=\"\",\"\",'P6'!B9)","v":""},{"$f":"IF('P7'!B9=\"\",\"\",'P7'!B9)","v":""},{"$f":"IF('P8'!B9=\"\",\"\",'P8'!B9)","v":""},{"$f":"IF('P9'!B9=\"\",\"\",'P9'!B9)","v":""},{"$f":"IF('P10'!B9=\"\",\"\",'P10'!B9)","v":""},{"$f":"IF('P11'!B9=\"\",\"\",'P11'!B9)","v":""},{"$f":"IF('P12'!B9=\"\",\"\",'P12'!B9)","v":""}]
["Evaluation de mise en œuvre ",{"$f":"IF('P1'!B10=\"\",\"\",'P1'!B10)","v":"Inconfort"},{"$f":"IF('P2'!B10=\"\",\"\",'P2'!B10)","v":"Attraction"},{"$f":"IF('P3'!B10=\"\",\"\",'P3'!B10)","v":"Résignation"},{"$f":"IF('P4'!B10=\"\",\"\",'P4'!B10)","v":""},{"$f":"IF('P5'!B10=\"\",\"\",'P5'!B10)","v":""},{"$f":"IF('P6'!B10=\"\",\"\",'P6'!B10)","v":""},{"$f":"IF('P7'!B10=\"\",\"\",'P7'!B10)","v":""},{"$f":"IF('P8'!B10=\"\",\"\",'P8'!B10)","v":""},{"$f":"IF('P9'!B10=\"\",\"\",'P9'!B10)","v":""},{"$f":"IF('P10'!B10=\"\",\"\",'P10'!B10)","v":""},{"$f":"IF('P11'!B10=\"\",\"\",'P11'!B10)","v":""},{"$f":"IF('P12'!B10=\"\",\"\",'P12'!B10)","v":""}]
["Evaluation financière ",{"$f":"IF('P1'!B11=\"\",\"\",'P1'!B11)","v":"Résignation"},{"$f":"IF('P2'!B11=\"\",\"\",'P2'!B11)","v":"Résignation"},{"$f":"IF('P3'!B11=\"\",\"\",'P3'!B11)","v":"Résignation"},{"$f":"IF('P4'!B11=\"\",\"\",'P4'!B11)","v":""},{"$f":"IF('P5'!B11=\"\",\"\",'P5'!B11)","v":""},{"$f":"IF('P6'!B11=\"\",\"\",'P6'!B11)","v":""},{"$f":"IF('P7'!B11=\"\",\"\",'P7'!B11)","v":""},{"$f":"IF('P8'!B11=\"\",\"\",'P8'!B11)","v":""},{"$f":"IF('P9'!B11=\"\",\"\",'P9'!B11)","v":""},{"$f":"IF('P10'!B11=\"\",\"\",'P10'!B11)","v":""},{"$f":"IF('P11'!B11=\"\",\"\",'P11'!B11)","v":""},{"$f":"IF('P12'!B11=\"\",\"\",'P12'!B11)","v":""}]
{"$rows_left_out":93}
{"sheet":"P1","index":2,"n_rows":103,"n_cols":2,"rows_kept":103,"cut":false,"hidden":false,"merged":[[0,0,0,3]]}
["Instructions :\n - Informe ton nom. Il sera repris pour la vue globale ;\n - Pour chacune des activités (compétence) ci-dessous, choisis dans quel quadrant CPT tu la placerais ;\n - Les lignes des titres des blocs d'activités sont optionnelles."]
["Nom de la personne :","Anne"]
["Activités","Quadrant CPT"]
[{"$f":"IF('Vue globale'!A3=\"\",\"\",'Vue globale'!A3)","v":"1. Conception et modélisation d’opportunités entrepreneuriales"}]
[{"$f":"IF('Vue globale'!A4=\"\",\"\",'Vue globale'!A4)","v":"Connaissance de l’environnement "},"Confort"]
[{"$f":"IF('Vue globale'!A5=\"\",\"\",'Vue globale'!A5)","v":"Recherche d’opportunités "},"Confort"]
[{"$f":"IF('Vue globale'!A6=\"\",\"\",'Vue globale'!A6)","v":"Mission et vision "},"Confort"]
[{"$f":"IF('Vue globale'!A7=\"\",\"\",'Vue globale'!A7)","v":"Business model "},"Confort"]
[{"$f":"IF('Vue globale'!A8=\"\",\"\",'Vue globale'!A8)","v":"Evaluation commerciale "},"Inconfort"]
[{"$f":"IF('Vue globale'!A9=\"\",\"\",'Vue globale'!A9)","v":"Evaluation de mise en œuvre "},"Inconfort"]
{"$rows_left_out":94}
{"sheet":"P2","index":3,"n_rows":103,"n_cols":2,"rows_kept":103,"cut":false,"hidden":false,"merged":[[0,0,0,3]]}
["Instructions :\n - Informe ton nom. Il sera repris pour la vue globale ;\n - Pour chacune des activités (compétence) ci-dessous, choisis dans quel quadrant CPT tu la placerais ;\n - Les lignes des titres des blocs d'activités sont optionnelles."]
["Nom de la personne :","Jean"]
["Activités","Quadrant CPT"]
[{"$f":"IF('Vue globale'!A3=\"\",\"\",'Vue globale'!A3)","v":"1. Conception et modélisation d’opportunités entrepreneuriales"}]
[{"$f":"IF('Vue globale'!A4=\"\",\"\",'Vue globale'!A4)","v":"Connaissance de l’environnement "},"Résignation"]
[{"$f":"IF('Vue globale'!A5=\"\",\"\",'Vue globale'!A5)","v":"Recherche d’opportunités "},"Résignation"]
[{"$f":"IF('Vue globale'!A6=\"\",\"\",'Vue globale'!A6)","v":"Mission et vision "},"Résignation"]
[{"$f":"IF('Vue globale'!A7=\"\",\"\",'Vue globale'!A7)","v":"Business model "},"Inconfort"]
[{"$f":"IF('Vue globale'!A8=\"\",\"\",'Vue globale'!A8)","v":"Evaluation commerciale "},"Résignation"]
[{"$f":"IF('Vue globale'!A9=\"\",\"\",'Vue globale'!A9)","v":"Evaluation de mise en œuvre "},"Attraction"]
{"$rows_left_out":94}
{"sheet":"P3","index":4,"n_rows":103,"n_cols":2,"rows_kept":103,"cut":false,"hidden":false,"merged":[[0,0,0,3]]}
["Instructions :\n - Informe ton nom. Il sera repris pour la vue globale ;\n - Pour chacune des activités (compétence) ci-dessous, choisis dans quel quadrant CPT tu la placerais ;\n - Les lignes des titres des blocs d'activités sont optionnelles."]
["Nom de la personne :","Dominique"]
["Activités","Quadrant CPT"]
[{"$f":"IF('Vue globale'!A3=\"\",\"\",'Vue globale'!A3)","v":"1. Conception et modélisation d’opportunités entrepreneuriales"}]
[{"$f":"IF('Vue globale'!A4=\"\",\"\",'Vue globale'!A4)","v":"Connaissance de l’environnement "},"Inconfort"]
[{"$f":"IF('Vue globale'!A5=\"\",\"\",'Vue globale'!A5)","v":"Recherche d’opportunités "},"Attraction"]
[{"$f":"IF('Vue globale'!A6=\"\",\"\",'Vue globale'!A6)","v":"Mission et vision "},"Attraction"]
[{"$f":"IF('Vue globale'!A7=\"\",\"\",'Vue globale'!A7)","v":"Business model "},"Attraction"]
[{"$f":"IF('Vue globale'!A8=\"\",\"\",'Vue globale'!A8)","v":"Evaluation commerciale "},"Attraction"]
[{"$f":"IF('Vue globale'!A9=\"\",\"\",'Vue globale'!A9)","v":"Evaluation de mise en œuvre "},"Résignation"]
{"$rows_left_out":94}
{"sheet":"P4","index":5,"n_rows":103,"n_cols":2,"rows_kept":103,"cut":false,"hidden":false,"merged":[[0,0,0,3]]}
["Instructions :\n - Informe ton nom. Il sera repris pour la vue globale ;\n - Pour chacune des activités (compétence) ci-dessous, choisis dans quel quadrant CPT tu la placerais ;\n - Les lignes des titres des blocs d'activités sont optionnelles."]
["Nom de la personne :","P4"]
["Activités","Quadrant CPT"]
[{"$f":"IF('Vue globale'!A3=\"\",\"\",'Vue globale'!A3)","v":"1. Conception et modélisation d’opportunités entrepreneuriales"}]
[{"$f":"IF('Vue globale'!A4=\"\",\"\",'Vue globale'!A4)","v":"Connaissance de l’environnement "}]
[{"$f":"IF('Vue globale'!A5=\"\",\"\",'Vue globale'!A5)","v":"Recherche d’opportunités "}]
[{"$f":"IF('Vue globale'!A6=\"\",\"\",'Vue globale'!A6)","v":"Mission et vision "}]
[{"$f":"IF('Vue globale'!A7=\"\",\"\",'Vue globale'!A7)","v":"Business model "}]
[{"$f":"IF('Vue globale'!A8=\"\",\"\",'Vue globale'!A8)","v":"Evaluation commerciale "}]
[{"$f":"IF('Vue globale'!A9=\"\",\"\",'Vue globale'!A9)","v":"Evaluation de mise en œuvre "}]
{"$rows_left_out":94}
{"sheet":"P5","index":6,"n_rows":103,"n_cols":2,"rows_kept":103,"cut":false,"hidden":false,"merged":[[0,0,0,3]]}
["Instructions :\n - Informe ton nom. Il sera repris pour la vue globale ;\n - Pour chacune des activités (compétence) ci-dessous, choisis dans quel quadrant CPT tu la placerais ;\n - Les lignes des titres des blocs d'activités sont optionnelles."]
["Nom de la personne :","P5"]
["Activités","Quadrant CPT"]
[{"$f":"IF('Vue globale'!A3=\"\",\"\",'Vue globale'!A3)","v":"1. Conception et modélisation d’opportunités entrepreneuriales"}]
[{"$f":"IF('Vue globale'!A4=\"\",\"\",'Vue globale'!A4)","v":"Connaissance de l’environnement "}]
[{"$f":"IF('Vue globale'!A5=\"\",\"\",'Vue globale'!A5)","v":"Recherche d’opportunités "}]
[{"$f":"IF('Vue globale'!A6=\"\",\"\",'Vue globale'!A6)","v":"Mission et vision "}]
[{"$f":"IF('Vue globale'!A7=\"\",\"\",'Vue globale'!A7)","v":"Business model "}]
[{"$f":"IF('Vue globale'!A8=\"\",\"\",'Vue globale'!A8)","v":"Evaluation commerciale "}]
[{"$f":"IF('Vue globale'!A9=\"\",\"\",'Vue globale'!A9)","v":"Evaluation de mise en œuvre "}]
{"$rows_left_out":94}
{"sheet":"P6","index":7,"n_rows":103,"n_cols":2,"rows_kept":103,"cut":false,"hidden":false,"merged":[[0,0,0,3]]}
["Instructions :\n - Informe ton nom. Il sera repris pour la vue globale ;\n - Pour chacune des activités (compétence) ci-dessous, choisis dans quel quadrant CPT tu la placerais ;\n - Les lignes des titres des blocs d'activités sont optionnelles."]
["Nom de la personne :","P6"]
["Activités","Quadrant CPT"]
[{"$f":"IF('Vue globale'!A3=\"\",\"\",'Vue globale'!A3)","v":"1. Conception et modélisation d’opportunités entrepreneuriales"}]
[{"$f":"IF('Vue globale'!A4=\"\",\"\",'Vue globale'!A4)","v":"Connaissance de l’environnement "}]
[{"$f":"IF('Vue globale'!A5=\"\",\"\",'Vue globale'!A5)","v":"Recherche d’opportunités "}]
[{"$f":"IF('Vue globale'!A6=\"\",\"\",'Vue globale'!A6)","v":"Mission et vision "}]
[{"$f":"IF('Vue globale'!A7=\"\",\"\",'Vue globale'!A7)","v":"Business model "}]
[{"$f":"IF('Vue globale'!A8=\"\",\"\",'Vue globale'!A8)","v":"Evaluation commerciale "}]
[{"$f":"IF('Vue globale'!A9=\"\",\"\",'Vue globale'!A9)","v":"Evaluation de mise en œuvre "}]
{"$rows_left_out":94}
{"sheet":"P7","index":8,"n_rows":103,"n_cols":2,"rows_kept":103,"cut":false,"hidden":false,"merged":[[0,0,0,3]]}
["Instructions :\n - Informe ton nom. Il sera repris pour la vue globale ;\n - Pour chacune des activités (compétence) ci-dessous, choisis dans quel quadrant CPT tu la placerais ;\n - Les lignes des titres des blocs d'activités sont optionnelles."]
["Nom de la personne :","P7"]
["Activités","Quadrant CPT"]
[{"$f":"IF('Vue globale'!A3=\"\",\"\",'Vue globale'!A3)","v":"1. Conception et modélisation d’opportunités entrepreneuriales"}]
[{"$f":"IF('Vue globale'!A4=\"\",\"\",'Vue globale'!A4)","v":"Connaissance de l’environnement "}]
[{"$f":"IF('Vue globale'!A5=\"\",\"\",'Vue globale'!A5)","v":"Recherche d’opportunités "}]
[{"$f":"IF('Vue globale'!A6=\"\",\"\",'Vue globale'!A6)","v":"Mission et vision "}]
[{"$f":"IF('Vue globale'!A7=\"\",\"\",'Vue globale'!A7)","v":"Business model "}]
[{"$f":"IF('Vue globale'!A8=\"\",\"\",'Vue globale'!A8)","v":"Evaluation commerciale "}]
[{"$f":"IF('Vue globale'!A9=\"\",\"\",'Vue globale'!A9)","v":"Evaluation de mise en œuvre "}]
{"$rows_left_out":94}
{"sheet":"P8","index":9,"n_rows":103,"n_cols":2,"rows_kept":103,"cut":false,"hidden":false,"merged":[[0,0,0,3]]}
["Instructions :\n - Informe ton nom. Il sera repris pour la vue globale ;\n - Pour chacune des activités (compétence) ci-dessous, choisis dans quel quadrant CPT tu la placerais ;\n - Les lignes des titres des blocs d'activités sont optionnelles."]
["Nom de la personne :","P8"]
["Activités","Quadrant CPT"]
[{"$f":"IF('Vue globale'!A3=\"\",\"\",'Vue globale'!A3)","v":"1. Conception et modélisation d’opportunités entrepreneuriales"}]
[{"$f":"IF('Vue globale'!A4=\"\",\"\",'Vue globale'!A4)","v":"Connaissance de l’environnement "}]
[{"$f":"IF('Vue globale'!A5=\"\",\"\",'Vue globale'!A5)","v":"Recherche d’opportunités "}]
[{"$f":"IF('Vue globale'!A6=\"\",\"\",'Vue globale'!A6)","v":"Mission et vision "}]
[{"$f":"IF('Vue globale'!A7=\"\",\"\",'Vue globale'!A7)","v":"Business model "}]
[{"$f":"IF('Vue globale'!A8=\"\",\"\",'Vue globale'!A8)","v":"Evaluation commerciale "}]
[{"$f":"IF('Vue globale'!A9=\"\",\"\",'Vue globale'!A9)","v":"Evaluation de mise en œuvre "}]
{"$rows_left_out":94}
{"sheet":"P9","index":10,"n_rows":103,"n_cols":2,"rows_kept":103,"cut":false,"hidden":false,"merged":[[0,0,0,3]]}
["Instructions :\n - Informe ton nom. Il sera repris pour la vue globale ;\n - Pour chacune des activités (compétence) ci-dessous, choisis dans quel quadrant CPT tu la placerais ;\n - Les lignes des titres des blocs d'activités sont optionnelles."]
["Nom de la personne :","P9"]
["Activités","Quadrant CPT"]
[{"$f":"IF('Vue globale'!A3=\"\",\"\",'Vue globale'!A3)","v":"1. Conception et modélisation d’opportunités entrepreneuriales"}]
[{"$f":"IF('Vue globale'!A4=\"\",\"\",'Vue globale'!A4)","v":"Connaissance de l’environnement "}]
[{"$f":"IF('Vue globale'!A5=\"\",\"\",'Vue globale'!A5)","v":"Recherche d’opportunités "}]
[{"$f":"IF('Vue globale'!A6=\"\",\"\",'Vue globale'!A6)","v":"Mission et vision "}]
[{"$f":"IF('Vue globale'!A7=\"\",\"\",'Vue globale'!A7)","v":"Business model "}]
[{"$f":"IF('Vue globale'!A8=\"\",\"\",'Vue globale'!A8)","v":"Evaluation commerciale "}]
[{"$f":"IF('Vue globale'!A9=\"\",\"\",'Vue globale'!A9)","v":"Evaluation de mise en œuvre "}]
{"$rows_left_out":94}
{"sheet":"P10","index":11,"n_rows":103,"n_cols":2,"rows_kept":103,"cut":false,"hidden":false,"merged":[[0,0,0,3]]}
["Instructions :\n - Informe ton nom. Il sera repris pour la vue globale ;\n - Pour chacune des activités (compétence) ci-dessous, choisis dans quel quadrant CPT tu la placerais ;\n - Les lignes des titres des blocs d'activités sont optionnelles."]
["Nom de la personne :","P10"]
["Activités","Quadrant CPT"]
[{"$f":"IF('Vue globale'!A3=\"\",\"\",'Vue globale'!A3)","v":"1. Conception et modélisation d’opportunités entrepreneuriales"}]
[{"$f":"IF('Vue globale'!A4=\"\",\"\",'Vue globale'!A4)","v":"Connaissance de l’environnement "}]
[{"$f":"IF('Vue globale'!A5=\"\",\"\",'Vue globale'!A5)","v":"Recherche d’opportunités "}]
[{"$f":"IF('Vue globale'!A6=\"\",\"\",'Vue globale'!A6)","v":"Mission et vision "}]
[{"$f":"IF('Vue globale'!A7=\"\",\"\",'Vue globale'!A7)","v":"Business model "}]
[{"$f":"IF('Vue globale'!A8=\"\",\"\",'Vue globale'!A8)","v":"Evaluation commerciale "}]
[{"$f":"IF('Vue globale'!A9=\"\",\"\",'Vue globale'!A9)","v":"Evaluation de mise en œuvre "}]
{"$rows_left_out":94}
{"sheet":"P11","index":12,"n_rows":103,"n_cols":2,"rows_kept":103,"cut":false,"hidden":false,"merged":[[0,0,0,3]]}
["Instructions :\n - Informe ton nom. Il sera repris pour la vue globale ;\n - Pour chacune des activités (compétence) ci-dessous, choisis dans quel quadrant CPT tu la placerais ;\n - Les lignes des titres des blocs d'activités sont optionnelles."]
["Nom de la personne :","P11"]
["Activités","Quadrant CPT"]
[{"$f":"IF('Vue globale'!A3=\"\",\"\",'Vue globale'!A3)","v":"1. Conception et modélisation d’opportunités entrepreneuriales"}]
[{"$f":"IF('Vue globale'!A4=\"\",\"\",'Vue globale'!A4)","v":"Connaissance de l’environnement "}]
[{"$f":"IF('Vue globale'!A5=\"\",\"\",'Vue globale'!A5)","v":"Recherche d’opportunités "}]
[{"$f":"IF('Vue globale'!A6=\"\",\"\",'Vue globale'!A6)","v":"Mission et vision "}]
[{"$f":"IF('Vue globale'!A7=\"\",\"\",'Vue globale'!A7)","v":"Business model "}]
[{"$f":"IF('Vue globale'!A8=\"\",\"\",'Vue globale'!A8)","v":"Evaluation commerciale "}]
[{"$f":"IF('Vue globale'!A9=\"\",\"\",'Vue globale'!A9)","v":"Evaluation de mise en œuvre "}]
{"$rows_left_out":94}
{"sheet":"P12","index":13,"n_rows":103,"n_cols":2,"rows_kept":103,"cut":false,"hidden":false,"merged":[[0,0,0,3]]}
["Instructions :\n - Informe ton nom. Il sera repris pour la vue globale ;\n - Pour chacune des activités (compétence) ci-dessous, choisis dans quel quadrant CPT tu la placerais ;\n - Les lignes des titres des blocs d'activités sont optionnelles."]
["Nom de la personne :","P12"]
["Activités","Quadrant CPT"]
[{"$f":"IF('Vue globale'!A3=\"\",\"\",'Vue globale'!A3)","v":"1. Conception et modélisation d’opportunités entrepreneuriales"}]
[{"$f":"IF('Vue globale'!A4=\"\",\"\",'Vue globale'!A4)","v":"Connaissance de l’environnement "}]
[{"$f":"IF('Vue globale'!A5=\"\",\"\",'Vue globale'!A5)","v":"Recherche d’opportunités "}]
[{"$f":"IF('Vue globale'!A6=\"\",\"\",'Vue globale'!A6)","v":"Mission et vision "}]
[{"$f":"IF('Vue globale'!A7=\"\",\"\",'Vue globale'!A7)","v":"Business model "}]
[{"$f":"IF('Vue globale'!A8=\"\",\"\",'Vue globale'!A8)","v":"Evaluation commerciale "}]
[{"$f":"IF('Vue globale'!A9=\"\",\"\",'Vue globale'!A9)","v":"Evaluation de mise en œuvre "}]
{"$rows_left_out":93}