{"text_format":"1","workbook":"xlsx","n_sheets":14,"sheets":["Instructions","Vue globale","P1","P2","P3","P4","P5","P6","P7","P8","P9","P10","P11","P12"],"not_rendered":{"charts":0,"images":3,"macros":1,"external_links":0,"defined_names":15,"comments":0,"pivot_tables":0},"unopened":[],"bounds":{"document_bytes":16777216,"sheet_cells":100000,"rows_first":2000,"rows_last":500,"rows_between":2000,"halvings":0,"cell_chars":16384,"cell_head_chars":4096},"cells_cut":0,"cells_raw":0,"read":"whole","date_system":"1900"}

{"sheet":"Instructions","index":0,"n_rows":8,"n_cols":2,"rows_kept":8,"cut":false,"hidden":false,"merged":[]}
[]
[null,"Matrice CPT organisationnelle - Instructions"]
[null,"Cet instrument permet de concentrer au même endroit les réponses d'une équipe de jusqu'à 12 personnes, en relation aux activités de l'organisation, d'est-à-dire en les classant dans les quatre quadrants de la matrice CPT :\n\n1) Confort :         J'ai la compétence pour l'activité et j'aime la réaliser ;\n1) Inconfort :      J'ai la compétence pour l'activité mais je n'aime pas la réaliser ;\n1) Attraction :     Je n'ai pas la compétence pour l'activité mais j'ai envie d'apprendre à  la réaliser ;\n1) Résignation :  Je n'ai pas la compétence pour l'activité et je n'aime pas la réaliser.\n\nLes activités sont celles définies dans le \"Référentiel de compétences organisationnelles et entrepreneuriales - V3.1\" de My-SBM, co-créé avec plus de 100 autres personnes."]
[]
[null,"Chaque membre de l'équipe peut se voir attribuer un des onglets, de P1 à P12 et ensuite indiquer pour chaque activité du tableau son ressenti : Confort, Inconfort, Attraction ou Résignation."]
[null,"L'onglet \"Vue globale\" reprend toutes les informations des onglets P1 à P12. Les boutons permettent alors de \"jouer\" avec le nuage des choix, effectués en fonction des activités, et d'utiliser ces vues pour distribuer les activités de la manière la plus équitable et performante au sein de l'équipe ou de l'organisation. Les cellules de l'attribution peuvent être formatées, même en étant protégées."]
[null,"La liste des activités peut être redéfinie dans la vue globale, avec un maximum de 100 activités. Les modifications se répercutent automatiquement sur les onglets P1 à P12."]
[null,"Pour éviter les surécritures accidentelles, tous les onglets sont protégés, mais sans mot de passe."]

{"sheet":"Vue globale","index":1,"n_rows":102,"n_cols":13,"rows_kept":102,"cut":false,"hidden":false,"merged":[[0,0,0,9]]}
["Instructions :\n - Ce tableau récupère les choix faits par un maximum de 12 personnes en relation à leur posture (compétence et préférence) de leur propre ressenti ;\n - Utilise les boutons pour tout montrer ou cacher, ou ne montrer que les choix d'un des quadrants de la matrice CPT ;\n - Les lignes des titres des blocs d'activités sont peut-être vides, car elles sont optionnelles ;\n - Efface les données exemple sur les onglets P1, P2 et P3."]
["Activités",{"$f":"'P1'!B2","v":"Anne"},{"$f":"'P2'!B2","v":"Jean"},{"$f":"'P3'!B2","v":"Dominique"},{"$f":"'P4'!B2","v":"P4"},{"$f":"'P5'!B2","v":"P5"},{"$f":"'P6'!B2","v":"P6"},{"$f":"'P7'!B2","v":"P7"},{"$f":"'P8'!B2","v":"P8"},{"$f":"'P9'!B2","v":"P9"},{"$f":"'P10'!B2","v":"P10"},{"$f":"'P11'!B2","v":"P11"},{"$f":"'P12'!B2","v":"P12"}]
["1. Conception et modélisation d’opportunités entrepreneuriales",{"$f":"IF('P1'!B4=\"\",\"\",'P1'!B4)","v":""},{"$f":"IF('P2'!B4=\"\",\"\",'P2'!B4)","v":""},{"$f":"IF('P3'!B4=\"\",\"\",'P3'!B4)","v":""},{"$f":"IF('P4'!B4=\"\",\"\",'P4'!B4)","v":""},{"$f":"IF('P5'!B4=\"\",\"\",'P5'!B4)","v":""},{"$f":"IF('P6'!B4=\"\",\"\",'P6'!B4)","v":""},{"$f":"IF('P7'!B4=\"\",\"\",'P7'!B4)","v":""},{"$f":"IF('P8'!B4=\"\",\"\",'P8'!B4)","v":""},{"$f":"IF('P9'!B4=\"\",\"\",'P9'!B4)","v":""},{"$f":"IF('P10'!B4=\"\",\"\",'P10'!B4)","v":""},{"$f":"IF('P11'!B4=\"\",\"\",'P11'!B4)","v":""},{"$f":"IF('P12'!B4=\"\",\"\",'P12'!B4)","v":""}]
["Connaissance de l’environnement ",{"$f":"IF('P1'!B5=\"\",\"\",'P1'!B5)","v":"Confort"},{"$f":"IF('P2'!B5=\"\",\"\",'P2'!B5)","v":"Résignation"},{"$f":"IF('P3'!B5=\"\",\"\",'P3'!B5)","v":"Inconfort"},{"$f":"IF('P4'!B5=\"\",\"\",'P4'!B5)","v":""},{"$f":"IF('P5'!B5=\"\",\"\",'P5'!B5)","v":""},{"$f":"IF('P6'!B5=\"\",\"\",'P6'!B5)","v":""},{"$f":"IF('P7'!B5=\"\",\"\",'P7'!B5)","v":""},{"$f":"IF('P8'!B5=\"\",\"\",'P8'!B5)","v":""},{"$f":"IF('P9'!B5=\"\",\"\",'P9'!B5)","v":""},{"$f":"IF('P10'!B5=\"\",\"\",'P10'!B5)","v":""},{"$f":"IF('P11'!B5=\"\",\"\",'P11'!B5)","v":""},{"$f":"IF('P12'!B5=\"\",\"\",'P12'!B5)","v":""}]
["Recherche d’opportunités ",{"$f":"IF('P1'!B6=\"\",\"\",'P1'!B6)","v":"Confort"},{"$f":"IF('P2'!B6=\"\",\"\",'P2'!B6)","v":"Résignation"},{"$f":"IF('P3'!B6=\"\",\"\",'P3'!B6)","v":"Attraction"},{"$f":"IF('P4'!B6=\"\",\"\",'P4'!B6)","v":""},{"$f":"IF('P5'!B6=\"\",\"\",'P5'!B6)","v":""},{"$f":"IF('P6'!B6=\"\",\"\",'P6'!B6)","v":""},{"$f":"IF('P7'!B6=\"\",\"\",'P7'!B6)","v":""},{"$f":"IF('P8'!B6=\"\",\"\",'P8'!B6)","v":""},{"$f":"IF('P9'!B6=\"\",\"\",'P9'!B6)","v":""},{"$f":"IF('P10'!B6=\"\",\"\",'P10'!B6)","v":""},{"$f":"IF('P11'!B6=\"\",\"\",'P11'!B6)","v":""},{"$f":"IF('P12'!B6=\"\",\"\",'P12'!B6)","v":""}]
["Mission et vision ",{"$f":"IF('P1'!B7=\"\",\"\",'P1'!B7)","v":"Confort"},{"$f":"IF('P2'!B7=\"\",\"\",'P2'!B7)","v":"Résignation"},{"$f":"IF('P3'!B7=\"\",\"\",'P3'!B7)","v":"Attraction"},{"$f":"IF('P4'!B7=\"\",\"\",'P4'!B7)","v":""},{"$f":"IF('P5'!B7=\"\",\"\",'P5'!B7)","v":""},{"$f":"IF('P6'!B7=\"\",\"\",'P6'!B7)","v":""},{"$f":"IF('P7'!B7=\"\",\"\",'P7'!B7)","v":""},{"$f":"IF('P8'!B7=\"\",\"\",'P8'!B7)","v":""},{"$f":"IF('P9'!B7=\"\",\"\",'P9'!B7)","v":""},{"$f":"IF('P10'!B7=\"\",\"\",'P10'!B7)","v":""},{"$f":"IF('P11'!B7=\"\",\"\",'P11'!B7)","v":""},{"$f":"IF('P12'!B7=\"\",\"\",'P12'!B7)","v":""}]
["Business model ",{"$f":"IF('P1'!B8=\"\",\"\",'P1'!B8)","v":"Confort"},{"$f":"IF('P2'!B8=\"\",\"\",'P2'!B8)","v":"Inconfort"},{"$f":"IF('P3'!B8=\"\",\"\",'P3'!B8)","v":"Attraction"},{"$f":"IF('P4'!B8=\"\",\"\",'P4'!B8)","v":""},{"$f":"IF('P5'!B8=\"\",\"\",'P5'!B8)","v":""},{"$f":"IF('P6'!B8=\"\",\"\",'P6'!B8)","v":""},{"$f":"IF('P7'!B8=\"\",\"\",'P7'!B8)","v":""},{"$f":"IF('P8'!B8=\"\",\"\",'P8'!B8)","v":""},{"$f":"IF('P9'!B8=\"\",\"\",'P9'!B8)","v":""},{"$f":"IF('P10'!B8=\"\",\"\",'P10'!B8)","v":""},{"$f":"IF('P11'!B8=\"\",\"\",'P11'!B8)","v":""},{"$f":"IF('P12'!B8=\"\",\"\",'P12'!B8)","v":""}]
["Evaluation commerciale ",{"$f":"IF('P1'!B9=\"\",\"\",'P1'!B9)","v":"Inconfort"},{"$f":"IF('P2'!B9=\"\",\"\",'P2'!B9)","v":"Résignation"},{"$f":"IF('P3'!B9=\"\",\"\",'P3'!B9)","v":"Attraction"},{"$f":"IF('P4'!B9=\"\",\"\",'P4'!B9)","v":""},{"$f":"IF('P5'!B9=\"\",\"\",'P5'!B9)","v":""},{"$f":"IF('P6'!B9=\"\",\"\",'P6'!B9)","v":""},{"$f":"IF('P7'!B9=\"\",\"\",'P7'!B9)","v":""},{"$f":"IF('P8'!B9=\"\",\"\",'P8'!B9)","v":""},{"$f":"IF('P9'!B9=\"\",\"\",'P9'!B9)","v":""},{"$f":"IF('P10'!B9=\"\",\"\",'P10'!B9)","v":""},{"$f":"IF('P11'!B9=\"\",\"\",'P11'!B9)","v":""},{"$f":"IF('P12'!B9=\"\",\"\",'P12'!B9)","v":""}]
["Evaluation de mise en œuvre ",{"$f":"IF('P1'!B10=\"\",\"\",'P1'!B10)","v":"Inconfort"},{"$f":"IF('P2'!B10=\"\",\"\",'P2'!B10)","v":"Attraction"},{"$f":"IF('P3'!B10=\"\",\"\",'P3'!B10)","v":"Résignation"},{"$f":"IF('P4'!B10=\"\",\"\",'P4'!B10)","v":""},{"$f":"IF('P5'!B10=\"\",\"\",'P5'!B10)","v":""},{"$f":"IF('P6'!B10=\"\",\"\",'P6'!B10)","v":""},{"$f":"IF('P7'!B10=\"\",\"\",'P7'!B10)","v":""},{"$f":"IF('P8'!B10=\"\",\"\",'P8'!B10)","v":""},{"$f":"IF('P9'!B10=\"\",\"\",'P9'!B10)","v":""},{"$f":"IF('P10'!B10=\"\",\"\",'P10'!B10)","v":""},{"$f":"IF('P11'!B10=\"\",\"\",'P11'!B10)","v":""},{"$f":"IF('P12'!B10=\"\",\"\",'P12'!B10)","v":""}]
["Evaluation financière ",{"$f":"IF('P1'!B11=\"\",\"\",'P1'!B11)","v":"Résignation"},{"$f":"IF('P2'!B11=\"\",\"\",'P2'!B11)","v":"Résignation"},{"$f":"IF('P3'!B11=\"\",\"\",'P3'!B11)","v":"Résignation"},{"$f":"IF('P4'!B11=\"\",\"\",'P4'!B11)","v":""},{"$f":"IF('P5'!B11=\"\",\"\",'P5'!B11)","v":""},{"$f":"IF('P6'!B11=\"\",\"\",'P6'!B11)","v":""},{"$f":"IF('P7'!B11=\"\",\"\",'P7'!B11)","v":""},{"$f":"IF('P8'!B11=\"\",\"\",'P8'!B11)","v":""},{"$f":"IF('P9'!B11=\"\",\"\",'P9'!B11)","v":""},{"$f":"IF('P10'!B11=\"\",\"\",'P10'!B11)","v":""},{"$f":"IF('P11'!B11=\"\",\"\",'P11'!B11)","v":""},{"$f":"IF('P12'!B11=\"\",\"\",'P12'!B11)","v":""}]
["2. Gestion de l’information",{"$f":"IF('P1'!B12=\"\",\"\",'P1'!B12)","v":""},{"$f":"IF('P2'!B12=\"\",\"\",'P2'!B12)","v":""},{"$f":"IF('P3'!B12=\"\",\"\",'P3'!B12)","v":""},{"$f":"IF('P4'!B12=\"\",\"\",'P4'!B12)","v":""},{"$f":"IF('P5'!B12=\"\",\"\",'P5'!B12)","v":""},{"$f":"IF('P6'!B12=\"\",\"\",'P6'!B12)","v":""},{"$f":"IF('P7'!B12=\"\",\"\",'P7'!B12)","v":""},{"$f":"IF('P8'!B12=\"\",\"\",'P8'!B12)","v":""},{"$f":"IF('P9'!B12=\"\",\"\",'P9'!B12)","v":""},{"$f":"IF('P10'!B12=\"\",\"\",'P10'!B12)","v":""},{"$f":"IF('P11'!B12=\"\",\"\",'P11'!B12)","v":""},{"$f":"IF('P12'!B12=\"\",\"\",'P12'!B12)","v":""}]
["Définition des besoins ",{"$f":"IF('P1'!B13=\"\",\"\",'P1'!B13)","v":"Attraction"},{"$f":"IF('P2'!B13=\"\",\"\",'P2'!B13)","v":"Confort"},{"$f":"IF('P3'!B13=\"\",\"\",'P3'!B13)","v":"Inconfort"},{"$f":"IF('P4'!B13=\"\",\"\",'P4'!B13)","v":""},{"$f":"IF('P5'!B13=\"\",\"\",'P5'!B13)","v":""},{"$f":"IF('P6'!B13=\"\",\"\",'P6'!B13)","v":""},{"$f":"IF('P7'!B13=\"\",\"\",'P7'!B13)","v":""},{"$f":"IF('P8'!B13=\"\",\"\",'P8'!B13)","v":""},{"$f":"IF('P9'!B13=\"\",\"\",'P9'!B13)","v":""},{"$f":"IF('P10'!B13=\"\",\"\",'P10'!B13)","v":""},{"$f":"IF('P11'!B13=\"\",\"\",'P11'!B13)","v":""},{"$f":"IF('P12'!B13=\"\",\"\",'P12'!B13)","v":""}]
["Identification de sources ",{"$f":"IF('P1'!B14=\"\",\"\",'P1'!B14)","v":"Attraction"},{"$f":"IF('P2'!B14=\"\",\"\",'P2'!B14)","v":"Inconfort"},{"$f":"IF('P3'!B14=\"\",\"\",'P3'!B14)","v":"Inconfort"},{"$f":"IF('P4'!B14=\"\",\"\",'P4'!B14)","v":""},{"$f":"IF('P5'!B14=\"\",\"\",'P5'!B14)","v":""},{"$f":"IF('P6'!B14=\"\",\"\",'P6'!B14)","v":""},{"$f":"IF('P7'!B14=\"\",\"\",'P7'!B14)","v":""},{"$f":"IF('P8'!B14=\"\",\"\",'P8'!B14)","v":""},{"$f":"IF('P9'!B14=\"\",\"\",'P9'!B14)","v":""},{"$f":"IF('P10'!B14=\"\",\"\",'P10'!B14)","v":""},{"$f":"IF('P11'!B14=\"\",\"\",'P11'!B14)","v":""},{"$f":"IF('P12'!B14=\"\",\"\",'P12'!B14)","v":""}]
["Veille informationnelle",{"$f":"IF('P1'!B15=\"\",\"\",'P1'!B15)","v":"Attraction"},{"$f":"IF('P2'!B15=\"\",\"\",'P2'!B15)","v":"Confort"},{"$f":"IF('P3'!B15=\"\",\"\",'P3'!B15)","v":"Confort"},{"$f":"IF('P4'!B15=\"\",\"\",'P4'!B15)","v":""},{"$f":"IF('P5'!B15=\"\",\"\",'P5'!B15)","v":""},{"$f":"IF('P6'!B15=\"\",\"\",'P6'!B15)","v":""},{"$f":"IF('P7'!B15=\"\",\"\",'P7'!B15)","v":""},{"$f":"IF('P8'!B15=\"\",\"\",'P8'!B15)","v":""},{"$f":"IF('P9'!B15=\"\",\"\",'P9'!B15)","v":""},{"$f":"IF('P10'!B15=\"\",\"\",'P10'!B15)","v":""},{"$f":"IF('P11'!B15=\"\",\"\",'P11'!B15)","v":""},{"$f":"IF('P12'!B15=\"\",\"\",'P12'!B15)","v":""}]
["Réseautage ",{"$f":"IF('P1'!B16=\"\",\"\",'P1'!B16)","v":"Inconfort"},{"$f":"IF('P2'!B16=\"\",\"\",'P2'!B16)","v":"Confort"},{"$f":"IF('P3'!B16=\"\",\"\",'P3'!B16)","v":"Inconfort"},{"$f":"IF('P4'!B16=\"\",\"\",'P4'!B16)","v":""},{"$f":"IF('P5'!B16=\"\",\"\",'P5'!B16)","v":""},{"$f":"IF('P6'!B16=\"\",\"\",'P6'!B16)","v":""},{"$f":"IF('P7'!B16=\"\",\"\",'P7'!B16)","v":""},{"$f":"IF('P8'!B16=\"\",\"\",'P8'!B16)","v":""},{"$f":"IF('P9'!B16=\"\",\"\",'P9'!B16)","v":""},{"$f":"IF('P10'!B16=\"\",\"\",'P10'!B16)","v":""},{"$f":"IF('P11'!B16=\"\",\"\",'P11'!B16)","v":""},{"$f":"IF('P12'!B16=\"\",\"\",'P12'!B16)","v":""}]
["Informatique et internet ",{"$f":"IF('P1'!B17=\"\",\"\",'P1'!B17)","v":"Attraction"},{"$f":"IF('P2'!B17=\"\",\"\",'P2'!B17)","v":"Inconfort"},{"$f":"IF('P3'!B17=\"\",\"\",'P3'!B17)","v":"Confort"},{"$f":"IF('P4'!B17=\"\",\"\",'P4'!B17)","v":""},{"$f":"IF('P5'!B17=\"\",\"\",'P5'!B17)","v":""},{"$f":"IF('P6'!B17=\"\",\"\",'P6'!B17)","v":""},{"$f":"IF('P7'!B17=\"\",\"\",'P7'!B17)","v":""},{"$f":"IF('P8'!B17=\"\",\"\",'P8'!B17)","v":""},{"$f":"IF('P9'!B17=\"\",\"\",'P9'!B17)","v":""},{"$f":"IF('P10'!B17=\"\",\"\",'P10'!B17)","v":""},{"$f":"IF('P11'!B17=\"\",\"\",'P11'!B17)","v":""},{"$f":"IF('P12'!B17=\"\",\"\",'P12'!B17)","v":""}]
["Analyse et synthèse",{"$f":"IF('P1'!B18=\"\",\"\",'P1'!B18)","v":"Attraction"},{"$f":"IF('P2'!B18=\"\",\"\",'P2'!B18)","v":"Inconfort"},{"$f":"IF('P3'!B18=\"\",\"\",'P3'!B18)","v":"Confort"},{"$f":"IF('P4'!B18=\"\",\"\",'P4'!B18)","v":""},{"$f":"IF('P5'!B18=\"\",\"\",'P5'!B18)","v":""},{"$f":"IF('P6'!B18=\"\",\"\",'P6'!B18)","v":""},{"$f":"IF('P7'!B18=\"\",\"\",'P7'!B18)","v":""},{"$f":"IF('P8'!B18=\"\",\"\",'P8'!B18)","v":""},{"$f":"IF('P9'!B18=\"\",\"\",'P9'!B18)","v":""},{"$f":"IF('P10'!B18=\"\",\"\",'P10'!B18)","v":""},{"$f":"IF('P11'!B18=\"\",\"\",'P11'!B18)","v":""},{"$f":"IF('P12'!B18=\"\",\"\",'P12'!B18)","v":""}]
["Gestion de la connaissance ",{"$f":"IF('P1'!B19=\"\",\"\",'P1'!B19)","v":"Attraction"},{"$f":"IF('P2'!B19=\"\",\"\",'P2'!B19)","v":"Attraction"},{"$f":"IF('P3'!B19=\"\",\"\",'P3'!B19)","v":"Confort"},{"$f":"IF('P4'!B19=\"\",\"\",'P4'!B19)","v":""},{"$f":"IF('P5'!B19=\"\",\"\",'P5'!B19)","v":""},{"$f":"IF('P6'!B19=\"\",\"\",'P6'!B19)","v":""},{"$f":"IF('P7'!B19=\"\",\"\",'P7'!B19)","v":""},{"$f":"IF('P8'!B19=\"\",\"\",'P8'!B19)","v":""},{"$f":"IF('P9'!B19=\"\",\"\",'P9'!B19)","v":""},{"$f":"IF('P10'!B19=\"\",\"\",'P10'!B19)","v":""},{"$f":"IF('P11'!B19=\"\",\"\",'P11'!B19)","v":""},{"$f":"IF('P12'!B19=\"\",\"\",'P12'!B19)","v":""}]
["3. Marketing",{"$f":"IF('P1'!B20=\"\",\"\",'P1'!B20)","v":""},{"$f":"IF('P2'!B20=\"\",\"\",'P2'!B20)","v":""},{"$f":"IF('P3'!B20=\"\",\"\",'P3'!B20)","v":""},{"$f":"IF('P4'!B20=\"\",\"\",'P4'!B20)","v":""},{"$f":"IF('P5'!B20=\"\",\"\",'P5'!B20)","v":""},{"$f":"IF('P6'!B20=\"\",\"\",'P6'!B20)","v":""},{"$f":"IF('P7'!B20=\"\",\"\",'P7'!B20)","v":""},{"$f":"IF('P8'!B20=\"\",\"\",'P8'!B20)","v":""},{"$f":"IF('P9'!B20=\"\",\"\",'P9'!B20)","v":""},{"$f":"IF('P10'!B20=\"\",\"\",'P10'!B20)","v":""},{"$f":"IF('P11'!B20=\"\",\"\",'P11'!B20)","v":""},{"$f":"IF('P12'!B20=\"\",\"\",'P12'!B20)","v":""}]
["Analyse d’opportunités ",{"$f":"IF('P1'!B21=\"\",\"\",'P1'!B21)","v":"Confort"},{"$f":"IF('P2'!B21=\"\",\"\",'P2'!B21)","v":"Confort"},{"$f":"IF('P3'!B21=\"\",\"\",'P3'!B21)","v":"Inconfort"},{"$f":"IF('P4'!B21=\"\",\"\",'P4'!B21)","v":""},{"$f":"IF('P5'!B21=\"\",\"\",'P5'!B21)","v":""},{"$f":"IF('P6'!B21=\"\",\"\",'P6'!B21)","v":""},{"$f":"IF('P7'!B21=\"\",\"\",'P7'!B21)","v":""},{"$f":"IF('P8'!B21=\"\",\"\",'P8'!B21)","v":""},{"$f":"IF('P9'!B21=\"\",\"\",'P9'!B21)","v":""},{"$f":"IF('P10'!B21=\"\",\"\",'P10'!B21)","v":""},{"$f":"IF('P11'!B21=\"\",\"\",'P11'!B21)","v":""},{"$f":"IF('P12'!B21=\"\",\"\",'P12'!B21)","v":""}]
["Etude de marché ",{"$f":"IF('P1'!B22=\"\",\"\",'P1'!B22)","v":"Inconfort"},{"$f":"IF('P2'!B22=\"\",\"\",'P2'!B22)","v":"Confort"},{"$f":"IF('P3'!B22=\"\",\"\",'P3'!B22)","v":"Confort"},{"$f":"IF('P4'!B22=\"\",\"\",'P4'!B22)","v":""},{"$f":"IF('P5'!B22=\"\",\"\",'P5'!B22)","v":""},{"$f":"IF('P6'!B22=\"\",\"\",'P6'!B22)","v":""},{"$f":"IF('P7'!B22=\"\",\"\",'P7'!B22)","v":""},{"$f":"IF('P8'!B22=\"\",\"\",'P8'!B22)","v":""},{"$f":"IF('P9'!B22=\"\",\"\",'P9'!B22)","v":""},{"$f":"IF('P10'!B22=\"\",\"\",'P10'!B22)","v":""},{"$f":"IF('P11'!B22=\"\",\"\",'P11'!B22)","v":""},{"$f":"IF('P12'!B22=\"\",\"\",'P12'!B22)","v":""}]
["Sélection de marché ",{"$f":"IF('P1'!B23=\"\",\"\",'P1'!B23)","v":"Attraction"},{"$f":"IF('P2'!B23=\"\",\"\",'P2'!B23)","v":"Confort"},{"$f":"IF('P3'!B23=\"\",\"\",'P3'!B23)","v":"Inconfort"},{"$f":"IF('P4'!B23=\"\",\"\",'P4'!B23)","v":""},{"$f":"IF('P5'!B23=\"\",\"\",'P5'!B23)","v":""},{"$f":"IF('P6'!B23=\"\",\"\",'P6'!B23)","v":""},{"$f":"IF('P7'!B23=\"\",\"\",'P7'!B23)","v":""},{"$f":"IF('P8'!B23=\"\",\"\",'P8'!B23)","v":""},{"$f":"IF('P9'!B23=\"\",\"\",'P9'!B23)","v":""},{"$f":"IF('P10'!B23=\"\",\"\",'P10'!B23)","v":""},{"$f":"IF('P11'!B23=\"\",\"\",'P11'!B23)","v":""},{"$f":"IF('P12'!B23=\"\",\"\",'P12'!B23)","v":""}]
["Conception de prestations ",{"$f":"IF('P1'!B24=\"\",\"\",'P1'!B24)","v":"Confort"},{"$f":"IF('P2'!B24=\"\",\"\",'P2'!B24)","v":"Confort"},{"$f":"IF('P3'!B24=\"\",\"\",'P3'!B24)","v":"Attraction"},{"$f":"IF('P4'!B24=\"\",\"\",'P4'!B24)","v":""},{"$f":"IF('P5'!B24=\"\",\"\",'P5'!B24)","v":""},{"$f":"IF('P6'!B24=\"\",\"\",'P6'!B24)","v":""},{"$f":"IF('P7'!B24=\"\",\"\",'P7'!B24)","v":""},{"$f":"IF('P8'!B24=\"\",\"\",'P8'!B24)","v":""},{"$f":"IF('P9'!B24=\"\",\"\",'P9'!B24)","v":""},{"$f":"IF('P10'!B24=\"\",\"\",'P10'!B24)","v":""},{"$f":"IF('P11'!B24=\"\",\"\",'P11'!B24)","v":""},{"$f":"IF('P12'!B24=\"\",\"\",'P12'!B24)","v":""}]
["Analyse de concurrence ",{"$f":"IF('P1'!B25=\"\",\"\",'P1'!B25)","v":"Inconfort"},{"$f":"IF('P2'!B25=\"\",\"\",'P2'!B25)","v":"Confort"},{"$f":"IF('P3'!B25=\"\",\"\",'P3'!B25)","v":"Inconfort"},{"$f":"IF('P4'!B25=\"\",\"\",'P4'!B25)","v":""},{"$f":"IF('P5'!B25=\"\",\"\",'P5'!B25)","v":""},{"$f":"IF('P6'!B25=\"\",\"\",'P6'!B25)","v":""},{"$f":"IF('P7'!B25=\"\",\"\",'P7'!B25)","v":""},{"$f":"IF('P8'!B25=\"\",\"\",'P8'!B25)","v":""},{"$f":"IF('P9'!B25=\"\",\"\",'P9'!B25)","v":""},{"$f":"IF('P10'!B25=\"\",\"\",'P10'!B25)","v":""},{"$f":"IF('P11'!B25=\"\",\"\",'P11'!B25)","v":""},{"$f":"IF('P12'!B25=\"\",\"\",'P12'!B25)","v":""}]
["Positionnement ",{"$f":"IF('P1'!B26=\"\",\"\",'P1'!B26)","v":"Inconfort"},{"$f":"IF('P2'!B26=\"\",\"\",'P2'!B26)","v":"Inconfort"},{"$f":"IF('P3'!B26=\"\",\"\",'P3'!B26)","v":"Résignation"},{"$f":"IF('P4'!B26=\"\",\"\",'P4'!B26)","v":""},{"$f":"IF('P5'!B26=\"\",\"\",'P5'!B26)","v":""},{"$f":"IF('P6'!B26=\"\",\"\",'P6'!B26)","v":""},{"$f":"IF('P7'!B26=\"\",\"\",'P7'!B26)","v":""},{"$f":"IF('P8'!B26=\"\",\"\",'P8'!B26)","v":""},{"$f":"IF('P9'!B26=\"\",\"\",'P9'!B26)","v":""},{"$f":"IF('P10'!B26=\"\",\"\",'P10'!B26)","v":""},{"$f":"IF('P11'!B26=\"\",\"\",'P11'!B26)","v":""},{"$f":"IF('P12'!B26=\"\",\"\",'P12'!B26)","v":""}]
["Stratégie marketing",{"$f":"IF('P1'!B27=\"\",\"\",'P1'!B27)","v":"Attraction"},{"$f":"IF('P2'!B27=\"\",\"\",'P2'!B27)","v":"Inconfort"},{"$f":"IF('P3'!B27=\"\",\"\",'P3'!B27)","v":"Résignation"},{"$f":"IF('P4'!B27=\"\",\"\",'P4'!B27)","v":""},{"$f":"IF('P5'!B27=\"\",\"\",'P5'!B27)","v":""},{"$f":"IF('P6'!B27=\"\",\"\",'P6'!B27)","v":""},{"$f":"IF('P7'!B27=\"\",\"\",'P7'!B27)","v":""},{"$f":"IF('P8'!B27=\"\",\"\",'P8'!B27)","v":""},{"$f":"IF('P9'!B27=\"\",\"\",'P9'!B27)","v":""},{"$f":"IF('P10'!B27=\"\",\"\",'P10'!B27)","v":""},{"$f":"IF('P11'!B27=\"\",\"\",'P11'!B27)","v":""},{"$f":"IF('P12'!B27=\"\",\"\",'P12'!B27)","v":""}]
["4. Promotion et ventes",{"$f":"IF('P1'!B28=\"\",\"\",'P1'!B28)","v":""},{"$f":"IF('P2'!B28=\"\",\"\",'P2'!B28)","v":""},{"$f":"IF('P3'!B28=\"\",\"\",'P3'!B28)","v":""},{"$f":"IF('P4'!B28=\"\",\"\",'P4'!B28)","v":""},{"$f":"IF('P5'!B28=\"\",\"\",'P5'!B28)","v":""},{"$f":"IF('P6'!B28=\"\",\"\",'P6'!B28)","v":""},{"$f":"IF('P7'!B28=\"\",\"\",'P7'!B28)","v":""},{"$f":"IF('P8'!B28=\"\",\"\",'P8'!B28)","v":""},{"$f":"IF('P9'!B28=\"\",\"\",'P9'!B28)","v":""},{"$f":"IF('P10'!B28=\"\",\"\",'P10'!B28)","v":""},{"$f":"IF('P11'!B28=\"\",\"\",'P11'!B28)","v":""},{"$f":"IF('P12'!B28=\"\",\"\",'P12'!B28)","v":""}]
["Stratégie commerciale ",{"$f":"IF('P1'!B29=\"\",\"\",'P1'!B29)","v":""},{"$f":"IF('P2'!B29=\"\",\"\",'P2'!B29)","v":""},{"$f":"IF('P3'!B29=\"\",\"\",'P3'!B29)","v":""},{"$f":"IF('P4'!B29=\"\",\"\",'P4'!B29)","v":""},{"$f":"IF('P5'!B29=\"\",\"\",'P5'!B29)","v":""},{"$f":"IF('P6'!B29=\"\",\"\",'P6'!B29)","v":""},{"$f":"IF('P7'!B29=\"\",\"\",'P7'!B29)","v":""},{"$f":"IF('P8'!B29=\"\",\"\",'P8'!B29)","v":""},{"$f":"IF('P9'!B29=\"\",\"\",'P9'!B29)","v":""},{"$f":"IF('P10'!B29=\"\",\"\",'P10'!B29)","v":""},{"$f":"IF('P11'!B29=\"\",\"\",'P11'!B29)","v":""},{"$f":"IF('P12'!B29=\"\",\"\",'P12'!B29)","v":""}]
["Formulation de l’offre ",{"$f":"IF('P1'!B30=\"\",\"\",'P1'!B30)","v":""},{"$f":"IF('P2'!B30=\"\",\"\",'P2'!B30)","v":""},{"$f":"IF('P3'!B30=\"\",\"\",'P3'!B30)","v":""},{"$f":"IF('P4'!B30=\"\",\"\",'P4'!B30)","v":""},{"$f":"IF('P5'!B30=\"\",\"\",'P5'!B30)","v":""},{"$f":"IF('P6'!B30=\"\",\"\",'P6'!B30)","v":""},{"$f":"IF('P7'!B30=\"\",\"\",'P7'!B30)","v":""},{"$f":"IF('P8'!B30=\"\",\"\",'P8'!B30)","v":""},{"$f":"IF('P9'!B30=\"\",\"\",'P9'!B30)","v":""},{"$f":"IF('P10'!B30=\"\",\"\",'P10'!B30)","v":""},{"$f":"IF('P11'!B30=\"\",\"\",'P11'!B30)","v":""},{"$f":"IF('P12'!B30=\"\",\"\",'P12'!B30)","v":""}]
["Choix des canaux ",{"$f":"IF('P1'!B31=\"\",\"\",'P1'!B31)","v":""},{"$f":"IF('P2'!B31=\"\",\"\",'P2'!B31)","v":""},{"$f":"IF('P3'!B31=\"\",\"\",'P3'!B31)","v":""},{"$f":"IF('P4'!B31=\"\",\"\",'P4'!B31)","v":""},{"$f":"IF('P5'!B31=\"\",\"\",'P5'!B31)","v":""},{"$f":"IF('P6'!B31=\"\",\"\",'P6'!B31)","v":""},{"$f":"IF('P7'!B31=\"\",\"\",'P7'!B31)","v":""},{"$f":"IF('P8'!B31=\"\",\"\",'P8'!B31)","v":""},{"$f":"IF('P9'!B31=\"\",\"\",'P9'!B31)","v":""},{"$f":"IF('P10'!B31=\"\",\"\",'P10'!B31)","v":""},{"$f":"IF('P11'!B31=\"\",\"\",'P11'!B31)","v":""},{"$f":"IF('P12'!B31=\"\",\"\",'P12'!B31)","v":""}]
["Promotion des ventes ",{"$f":"IF('P1'!B32=\"\",\"\",'P1'!B32)","v":""},{"$f":"IF('P2'!B32=\"\",\"\",'P2'!B32)","v":""},{"$f":"IF('P3'!B32=\"\",\"\",'P3'!B32)","v":""},{"$f":"IF('P4'!B32=\"\",\"\",'P4'!B32)","v":""},{"$f":"IF('P5'!B32=\"\",\"\",'P5'!B32)","v":""},{"$f":"IF('P6'!B32=\"\",\"\",'P6'!B32)","v":""},{"$f":"IF('P7'!B32=\"\",\"\",'P7'!B32)","v":""},{"$f":"IF('P8'!B32=\"\",\"\",'P8'!B32)","v":""},{"$f":"IF('P9'!B32=\"\",\"\",'P9'!B32)","v":""},{"$f":"IF('P10'!B32=\"\",\"\",'P10'!B32)","v":""},{"$f":"IF('P11'!B32=\"\",\"\",'P11'!B32)","v":""},{"$f":"IF('P12'!B32=\"\",\"\",'P12'!B32)","v":""}]
["Prospection et acquisition ",{"$f":"IF('P1'!B33=\"\",\"\",'P1'!B33)","v":""},{"$f":"IF('P2'!B33=\"\",\"\",'P2'!B33)","v":""},{"$f":"IF('P3'!B33=\"\",\"\",'P3'!B33)","v":""},{"$f":"IF('P4'!B33=\"\",\"\",'P4'!B33)","v":""},{"$f":"IF('P5'!B33=\"\",\"\",'P5'!B33)","v":""},{"$f":"IF('P6'!B33=\"\",\"\",'P6'!B33)","v":""},{"$f":"IF('P7'!B33=\"\",\"\",'P7'!B33)","v":""},{"$f":"IF('P8'!B33=\"\",\"\",'P8'!B33)","v":""},{"$f":"IF('P9'!B33=\"\",\"\",'P9'!B33)","v":""},{"$f":"IF('P10'!B33=\"\",\"\",'P10'!B33)","v":""},{"$f":"IF('P11'!B33=\"\",\"\",'P11'!B33)","v":""},{"$f":"IF('P12'!B33=\"\",\"\",'P12'!B33)","v":""}]
["Suivi commercial ",{"$f":"IF('P1'!B34=\"\",\"\",'P1'!B34)","v":""},{"$f":"IF('P2'!B34=\"\",\"\",'P2'!B34)","v":""},{"$f":"IF('P3'!B34=\"\",\"\",'P3'!B34)","v":""},{"$f":"IF('P4'!B34=\"\",\"\",'P4'!B34)","v":""},{"$f":"IF('P5'!B34=\"\",\"\",'P5'!B34)","v":""},{"$f":"IF('P6'!B34=\"\",\"\",'P6'!B34)","v":""},{"$f":"IF('P7'!B34=\"\",\"\",'P7'!B34)","v":""},{"$f":"IF('P8'!B34=\"\",\"\",'P8'!B34)","v":""},{"$f":"IF('P9'!B34=\"\",\"\",'P9'!B34)","v":""},{"$f":"IF('P10'!B34=\"\",\"\",'P10'!B34)","v":""},{"$f":"IF('P11'!B34=\"\",\"\",'P11'!B34)","v":""},{"$f":"IF('P12'!B34=\"\",\"\",'P12'!B34)","v":""}]
["Fidélisation ",{"$f":"IF('P1'!B35=\"\",\"\",'P1'!B35)","v":""},{"$f":"IF('P2'!B35=\"\",\"\",'P2'!B35)","v":""},{"$f":"IF('P3'!B35=\"\",\"\",'P3'!B35)","v":""},{"$f":"IF('P4'!B35=\"\",\"\",'P4'!B35)","v":""},{"$f":"IF('P5'!B35=\"\",\"\",'P5'!B35)","v":""},{"$f":"IF('P6'!B35=\"\",\"\",'P6'!B35)","v":""},{"$f":"IF('P7'!B35=\"\",\"\",'P7'!B35)","v":""},{"$f":"IF('P8'!B35=\"\",\"\",'P8'!B35)","v":""},{"$f":"IF('P9'!B35=\"\",\"\",'P9'!B35)","v":""},{"$f":"IF('P10'!B35=\"\",\"\",'P10'!B35)","v":""},{"$f":"IF('P11'!B35=\"\",\"\",'P11'!B35)","v":""},{"$f":"IF('P12'!B35=\"\",\"\",'P12'!B35)","v":""}]
["5. Relations et communication institutionnelles",{"$f":"IF('P1'!B36=\"\",\"\",'P1'!B36)","v":""},{"$f":"IF('P2'!B36=\"\",\"\",'P2'!B36)","v":""},{"$f":"IF('P3'!B36=\"\",\"\",'P3'!B36)","v":""},{"$f":"IF('P4'!B36=\"\",\"\",'P4'!B36)","v":""},{"$f":"IF('P5'!B36=\"\",\"\",'P5'!B36)","v":""},{"$f":"IF('P6'!B36=\"\",\"\",'P6'!B36)","v":""},{"$f":"IF('P7'!B36=\"\",\"\",'P7'!B36)","v":""},{"$f":"IF('P8'!B36=\"\",\"\",'P8'!B36)","v":""},{"$f":"IF('P9'!B36=\"\",\"\",'P9'!B36)","v":""},{"$f":"IF('P10'!B36=\"\",\"\",'P10'!B36)","v":""},{"$f":"IF('P11'!B36=\"\",\"\",'P11'!B36)","v":""},{"$f":"IF('P12'!B36=\"\",\"\",'P12'!B36)","v":""}]
["Sphère d’influence ",{"$f":"IF('P1'!B37=\"\",\"\",'P1'!B37)","v":""},{"$f":"IF('P2'!B37=\"\",\"\",'P2'!B37)","v":""},{"$f":"IF('P3'!B37=\"\",\"\",'P3'!B37)","v":""},{"$f":"IF('P4'!B37=\"\",\"\",'P4'!B37)","v":""},{"$f":"IF('P5'!B37=\"\",\"\",'P5'!B37)","v":""},{"$f":"IF('P6'!B37=\"\",\"\",'P6'!B37)","v":""},{"$f":"IF('P7'!B37=\"\",\"\",'P7'!B37)","v":""},{"$f":"IF('P8'!B37=\"\",\"\",'P8'!B37)","v":""},{"$f":"IF('P9'!B37=\"\",\"\",'P9'!B37)","v":""},{"$f":"IF('P10'!B37=\"\",\"\",'P10'!B37)","v":""},{"$f":"IF('P11'!B37=\"\",\"\",'P11'!B37)","v":""},{"$f":"IF('P12'!B37=\"\",\"\",'P12'!B37)","v":""}]
["Communication institutionnelle ",{"$f":"IF('P1'!B38=\"\",\"\",'P1'!B38)","v":""},{"$f":"IF('P2'!B38=\"\",\"\",'P2'!B38)","v":""},{"$f":"IF('P3'!B38=\"\",\"\",'P3'!B38)","v":""},{"$f":"IF('P4'!B38=\"\",\"\",'P4'!B38)","v":""},{"$f":"IF('P5'!B38=\"\",\"\",'P5'!B38)","v":""},{"$f":"IF('P6'!B38=\"\",\"\",'P6'!B38)","v":""},{"$f":"IF('P7'!B38=\"\",\"\",'P7'!B38)","v":""},{"$f":"IF('P8'!B38=\"\",\"\",'P8'!B38)","v":""},{"$f":"IF('P9'!B38=\"\",\"\",'P9'!B38)","v":""},{"$f":"IF('P10'!B38=\"\",\"\",'P10'!B38)","v":""},{"$f":"IF('P11'!B38=\"\",\"\",'P11'!B38)","v":""},{"$f":"IF('P12'!B38=\"\",\"\",'P12'!B38)","v":""}]
["Communication dans les médias ",{"$f":"IF('P1'!B39=\"\",\"\",'P1'!B39)","v":""},{"$f":"IF('P2'!B39=\"\",\"\",'P2'!B39)","v":""},{"$f":"IF('P3'!B39=\"\",\"\",'P3'!B39)","v":""},{"$f":"IF('P4'!B39=\"\",\"\",'P4'!B39)","v":""},{"$f":"IF('P5'!B39=\"\",\"\",'P5'!B39)","v":""},{"$f":"IF('P6'!B39=\"\",\"\",'P6'!B39)","v":""},{"$f":"IF('P7'!B39=\"\",\"\",'P7'!B39)","v":""},{"$f":"IF('P8'!B39=\"\",\"\",'P8'!B39)","v":""},{"$f":"IF('P9'!B39=\"\",\"\",'P9'!B39)","v":""},{"$f":"IF('P10'!B39=\"\",\"\",'P10'!B39)","v":""},{"$f":"IF('P11'!B39=\"\",\"\",'P11'!B39)","v":""},{"$f":"IF('P12'!B39=\"\",\"\",'P12'!B39)","v":""}]
["Réseaux sociaux ",{"$f":"IF('P1'!B40=\"\",\"\",'P1'!B40)","v":""},{"$f":"IF('P2'!B40=\"\",\"\",'P2'!B40)","v":""},{"$f":"IF('P3'!B40=\"\",\"\",'P3'!B40)","v":""},{"$f":"IF('P4'!B40=\"\",\"\",'P4'!B40)","v":""},{"$f":"IF('P5'!B40=\"\",\"\",'P5'!B40)","v":""},{"$f":"IF('P6'!B40=\"\",\"\",'P6'!B40)","v":""},{"$f":"IF('P7'!B40=\"\",\"\",'P7'!B40)","v":""},{"$f":"IF('P8'!B40=\"\",\"\",'P8'!B40)","v":""},{"$f":"IF('P9'!B40=\"\",\"\",'P9'!B40)","v":""},{"$f":"IF('P10'!B40=\"\",\"\",'P10'!B40)","v":""},{"$f":"IF('P11'!B40=\"\",\"\",'P11'!B40)","v":""},{"$f":"IF('P12'!B40=\"\",\"\",'P12'!B40)","v":""}]
["Gouvernance externe ",{"$f":"IF('P1'!B41=\"\",\"\",'P1'!B41)","v":""},{"$f":"IF('P2'!B41=\"\",\"\",'P2'!B41)","v":""},{"$f":"IF('P3'!B41=\"\",\"\",'P3'!B41)","v":""},{"$f":"IF('P4'!B41=\"\",\"\",'P4'!B41)","v":""},{"$f":"IF('P5'!B41=\"\",\"\",'P5'!B41)","v":""},{"$f":"IF('P6'!B41=\"\",\"\",'P6'!B41)","v":""},{"$f":"IF('P7'!B41=\"\",\"\",'P7'!B41)","v":""},{"$f":"IF('P8'!B41=\"\",\"\",'P8'!B41)","v":""},{"$f":"IF('P9'!B41=\"\",\"\",'P9'!B41)","v":""},{"$f":"IF('P10'!B41=\"\",\"\",'P10'!B41)","v":""},{"$f":"IF('P11'!B41=\"\",\"\",'P11'!B41)","v":""},{"$f":"IF('P12'!B41=\"\",\"\",'P12'!B41)","v":""}]
["Alliances et partenariats ",{"$f":"IF('P1'!B42=\"\",\"\",'P1'!B42)","v":""},{"$f":"IF('P2'!B42=\"\",\"\",'P2'!B42)","v":""},{"$f":"IF('P3'!B42=\"\",\"\",'P3'!B42)","v":""},{"$f":"IF('P4'!B42=\"\",\"\",'P4'!B42)","v":""},{"$f":"IF('P5'!B42=\"\",\"\",'P5'!B42)","v":""},{"$f":"IF('P6'!B42=\"\",\"\",'P6'!B42)","v":""},{"$f":"IF('P7'!B42=\"\",\"\",'P7'!B42)","v":""},{"$f":"IF('P8'!B42=\"\",\"\",'P8'!B42)","v":""},{"$f":"IF('P9'!B42=\"\",\"\",'P9'!B42)","v":""},{"$f":"IF('P10'!B42=\"\",\"\",'P10'!B42)","v":""},{"$f":"IF('P11'!B42=\"\",\"\",'P11'!B42)","v":""},{"$f":"IF('P12'!B42=\"\",\"\",'P12'!B42)","v":""}]
["6. Stratégie et gestion de projets",{"$f":"IF('P1'!B43=\"\",\"\",'P1'!B43)","v":""},{"$f":"IF('P2'!B43=\"\",\"\",'P2'!B43)","v":""},{"$f":"IF('P3'!B43=\"\",\"\",'P3'!B43)","v":""},{"$f":"IF('P4'!B43=\"\",\"\",'P4'!B43)","v":""},{"$f":"IF('P5'!B43=\"\",\"\",'P5'!B43)","v":""},{"$f":"IF('P6'!B43=\"\",\"\",'P6'!B43)","v":""},{"$f":"IF('P7'!B43=\"\",\"\",'P7'!B43)","v":""},{"$f":"IF('P8'!B43=\"\",\"\",'P8'!B43)","v":""},{"$f":"IF('P9'!B43=\"\",\"\",'P9'!B43)","v":""},{"$f":"IF('P10'!B43=\"\",\"\",'P10'!B43)","v":""},{"$f":"IF('P11'!B43=\"\",\"\",'P11'!B43)","v":""},{"$f":"IF('P12'!B43=\"\",\"\",'P12'!B43)","v":""}]
["Vision stratégique ",{"$f":"IF('P1'!B44=\"\",\"\",'P1'!B44)","v":""},{"$f":"IF('P2'!B44=\"\",\"\",'P2'!B44)","v":""},{"$f":"IF('P3'!B44=\"\",\"\",'P3'!B44)","v":""},{"$f":"IF('P4'!B44=\"\",\"\",'P4'!B44)","v":""},{"$f":"IF('P5'!B44=\"\",\"\",'P5'!B44)","v":""},{"$f":"IF('P6'!B44=\"\",\"\",'P6'!B44)","v":""},{"$f":"IF('P7'!B44=\"\",\"\",'P7'!B44)","v":""},{"$f":"IF('P8'!B44=\"\",\"\",'P8'!B44)","v":""},{"$f":"IF('P9'!B44=\"\",\"\",'P9'!B44)","v":""},{"$f":"IF('P10'!B44=\"\",\"\",'P10'!B44)","v":""},{"$f":"IF('P11'!B44=\"\",\"\",'P11'!B44)","v":""},{"$f":"IF('P12'!B44=\"\",\"\",'P12'!B44)","v":""}]
["Gestion des risques ",{"$f":"IF('P1'!B45=\"\",\"\",'P1'!B45)","v":""},{"$f":"IF('P2'!B45=\"\",\"\",'P2'!B45)","v":""},{"$f":"IF('P3'!B45=\"\",\"\",'P3'!B45)","v":""},{"$f":"IF('P4'!B45=\"\",\"\",'P4'!B45)","v":""},{"$f":"IF('P5'!B45=\"\",\"\",'P5'!B45)","v":""},{"$f":"IF('P6'!B45=\"\",\"\",'P6'!B45)","v":""},{"$f":"IF('P7'!B45=\"\",\"\",'P7'!B45)","v":""},{"$f":"IF('P8'!B45=\"\",\"\",'P8'!B45)","v":""},{"$f":"IF('P9'!B45=\"\",\"\",'P9'!B45)","v":""},{"$f":"IF('P10'!B45=\"\",\"\",'P10'!B45)","v":""},{"$f":"IF('P11'!B45=\"\",\"\",'P11'!B45)","v":""},{"$f":"IF('P12'!B45=\"\",\"\",'P12'!B45)","v":""}]
["Stratégie de développement ",{"$f":"IF('P1'!B46=\"\",\"\",'P1'!B46)","v":""},{"$f":"IF('P2'!B46=\"\",\"\",'P2'!B46)","v":""},{"$f":"IF('P3'!B46=\"\",\"\",'P3'!B46)","v":""},{"$f":"IF('P4'!B46=\"\",\"\",'P4'!B46)","v":""},{"$f":"IF('P5'!B46=\"\",\"\",'P5'!B46)","v":""},{"$f":"IF('P6'!B46=\"\",\"\",'P6'!B46)","v":""},{"$f":"IF('P7'!B46=\"\",\"\",'P7'!B46)","v":""},{"$f":"IF('P8'!B46=\"\",\"\",'P8'!B46)","v":""},{"$f":"IF('P9'!B46=\"\",\"\",'P9'!B46)","v":""},{"$f":"IF('P10'!B46=\"\",\"\",'P10'!B46)","v":""},{"$f":"IF('P11'!B46=\"\",\"\",'P11'!B46)","v":""},{"$f":"IF('P12'!B46=\"\",\"\",'P12'!B46)","v":""}]
["Fixation d’objectifs ",{"$f":"IF('P1'!B47=\"\",\"\",'P1'!B47)","v":""},{"$f":"IF('P2'!B47=\"\",\"\",'P2'!B47)","v":""},{"$f":"IF('P3'!B47=\"\",\"\",'P3'!B47)","v":""},{"$f":"IF('P4'!B47=\"\",\"\",'P4'!B47)","v":""},{"$f":"IF('P5'!B47=\"\",\"\",'P5'!B47)","v":""},{"$f":"IF('P6'!B47=\"\",\"\",'P6'!B47)","v":""},{"$f":"IF('P7'!B47=\"\",\"\",'P7'!B47)","v":""},{"$f":"IF('P8'!B47=\"\",\"\",'P8'!B47)","v":""},{"$f":"IF('P9'!B47=\"\",\"\",'P9'!B47)","v":""},{"$f":"IF('P10'!B47=\"\",\"\",'P10'!B47)","v":""},{"$f":"IF('P11'!B47=\"\",\"\",'P11'!B47)","v":""},{"$f":"IF('P12'!B47=\"\",\"\",'P12'!B47)","v":""}]
["Mesure de résultats ",{"$f":"IF('P1'!B48=\"\",\"\",'P1'!B48)","v":""},{"$f":"IF('P2'!B48=\"\",\"\",'P2'!B48)","v":""},{"$f":"IF('P3'!B48=\"\",\"\",'P3'!B48)","v":""},{"$f":"IF('P4'!B48=\"\",\"\",'P4'!B48)","v":""},{"$f":"IF('P5'!B48=\"\",\"\",'P5'!B48)","v":""},{"$f":"IF('P6'!B48=\"\",\"\",'P6'!B48)","v":""},{"$f":"IF('P7'!B48=\"\",\"\",'P7'!B48)","v":""},{"$f":"IF('P8'!B48=\"\",\"\",'P8'!B48)","v":""},{"$f":"IF('P9'!B48=\"\",\"\",'P9'!B48)","v":""},{"$f":"IF('P10'!B48=\"\",\"\",'P10'!B48)","v":""},{"$f":"IF('P11'!B48=\"\",\"\",'P11'!B48)","v":""},{"$f":"IF('P12'!B48=\"\",\"\",'P12'!B48)","v":""}]
["Gestion de projets ",{"$f":"IF('P1'!B49=\"\",\"\",'P1'!B49)","v":""},{"$f":"IF('P2'!B49=\"\",\"\",'P2'!B49)","v":""},{"$f":"IF('P3'!B49=\"\",\"\",'P3'!B49)","v":""},{"$f":"IF('P4'!B49=\"\",\"\",'P4'!B49)","v":""},{"$f":"IF('P5'!B49=\"\",\"\",'P5'!B49)","v":""},{"$f":"IF('P6'!B49=\"\",\"\",'P6'!B49)","v":""},{"$f":"IF('P7'!B49=\"\",\"\",'P7'!B49)","v":""},{"$f":"IF('P8'!B49=\"\",\"\",'P8'!B49)","v":""},{"$f":"IF('P9'!B49=\"\",\"\",'P9'!B49)","v":""},{"$f":"IF('P10'!B49=\"\",\"\",'P10'!B49)","v":""},{"$f":"IF('P11'!B49=\"\",\"\",'P11'!B49)","v":""},{"$f":"IF('P12'!B49=\"\",\"\",'P12'!B49)","v":""}]
["Evaluation ",{"$f":"IF('P1'!B50=\"\",\"\",'P1'!B50)","v":""},{"$f":"IF('P2'!B50=\"\",\"\",'P2'!B50)","v":""},{"$f":"IF('P3'!B50=\"\",\"\",'P3'!B50)","v":""},{"$f":"IF('P4'!B50=\"\",\"\",'P4'!B50)","v":""},{"$f":"IF('P5'!B50=\"\",\"\",'P5'!B50)","v":""},{"$f":"IF('P6'!B50=\"\",\"\",'P6'!B50)","v":""},{"$f":"IF('P7'!B50=\"\",\"\",'P7'!B50)","v":""},{"$f":"IF('P8'!B50=\"\",\"\",'P8'!B50)","v":""},{"$f":"IF('P9'!B50=\"\",\"\",'P9'!B50)","v":""},{"$f":"IF('P10'!B50=\"\",\"\",'P10'!B50)","v":""},{"$f":"IF('P11'!B50=\"\",\"\",'P11'!B50)","v":""},{"$f":"IF('P12'!B50=\"\",\"\",'P12'!B50)","v":""}]
["7. organisation, production et logistique",{"$f":"IF('P1'!B51=\"\",\"\",'P1'!B51)","v":""},{"$f":"IF('P2'!B51=\"\",\"\",'P2'!B51)","v":""},{"$f":"IF('P3'!B51=\"\",\"\",'P3'!B51)","v":""},{"$f":"IF('P4'!B51=\"\",\"\",'P4'!B51)","v":""},{"$f":"IF('P5'!B51=\"\",\"\",'P5'!B51)","v":""},{"$f":"IF('P6'!B51=\"\",\"\",'P6'!B51)","v":""},{"$f":"IF('P7'!B51=\"\",\"\",'P7'!B51)","v":""},{"$f":"IF('P8'!B51=\"\",\"\",'P8'!B51)","v":""},{"$f":"IF('P9'!B51=\"\",\"\",'P9'!B51)","v":""},{"$f":"IF('P10'!B51=\"\",\"\",'P10'!B51)","v":""},{"$f":"IF('P11'!B51=\"\",\"\",'P11'!B51)","v":""},{"$f":"IF('P12'!B51=\"\",\"\",'P12'!B51)","v":""}]
["Administration",{"$f":"IF('P1'!B52=\"\",\"\",'P1'!B52)","v":""},{"$f":"IF('P2'!B52=\"\",\"\",'P2'!B52)","v":""},{"$f":"IF('P3'!B52=\"\",\"\",'P3'!B52)","v":""},{"$f":"IF('P4'!B52=\"\",\"\",'P4'!B52)","v":""},{"$f":"IF('P5'!B52=\"\",\"\",'P5'!B52)","v":""},{"$f":"IF('P6'!B52=\"\",\"\",'P6'!B52)","v":""},{"$f":"IF('P7'!B52=\"\",\"\",'P7'!B52)","v":""},{"$f":"IF('P8'!B52=\"\",\"\",'P8'!B52)","v":""},{"$f":"IF('P9'!B52=\"\",\"\",'P9'!B52)","v":""},{"$f":"IF('P10'!B52=\"\",\"\",'P10'!B52)","v":""},{"$f":"IF('P11'!B52=\"\",\"\",'P11'!B52)","v":""},{"$f":"IF('P12'!B52=\"\",\"\",'P12'!B52)","v":""}]
["Qualité",{"$f":"IF('P1'!B53=\"\",\"\",'P1'!B53)","v":""},{"$f":"IF('P2'!B53=\"\",\"\",'P2'!B53)","v":""},{"$f":"IF('P3'!B53=\"\",\"\",'P3'!B53)","v":""},{"$f":"IF('P4'!B53=\"\",\"\",'P4'!B53)","v":""},{"$f":"IF('P5'!B53=\"\",\"\",'P5'!B53)","v":""},{"$f":"IF('P6'!B53=\"\",\"\",'P6'!B53)","v":""},{"$f":"IF('P7'!B53=\"\",\"\",'P7'!B53)","v":""},{"$f":"IF('P8'!B53=\"\",\"\",'P8'!B53)","v":""},{"$f":"IF('P9'!B53=\"\",\"\",'P9'!B53)","v":""},{"$f":"IF('P10'!B53=\"\",\"\",'P10'!B53)","v":""},{"$f":"IF('P11'!B53=\"\",\"\",'P11'!B53)","v":""},{"$f":"IF('P12'!B53=\"\",\"\",'P12'!B53)","v":""}]
["Ressources",{"$f":"IF('P1'!B54=\"\",\"\",'P1'!B54)","v":""},{"$f":"IF('P2'!B54=\"\",\"\",'P2'!B54)","v":""},{"$f":"IF('P3'!B54=\"\",\"\",'P3'!B54)","v":""},{"$f":"IF('P4'!B54=\"\",\"\",'P4'!B54)","v":""},{"$f":"IF('P5'!B54=\"\",\"\",'P5'!B54)","v":""},{"$f":"IF('P6'!B54=\"\",\"\",'P6'!B54)","v":""},{"$f":"IF('P7'!B54=\"\",\"\",'P7'!B54)","v":""},{"$f":"IF('P8'!B54=\"\",\"\",'P8'!B54)","v":""},{"$f":"IF('P9'!B54=\"\",\"\",'P9'!B54)","v":""},{"$f":"IF('P10'!B54=\"\",\"\",'P10'!B54)","v":""},{"$f":"IF('P11'!B54=\"\",\"\",'P11'!B54)","v":""},{"$f":"IF('P12'!B54=\"\",\"\",'P12'!B54)","v":""}]
["Infrastructure",{"$f":"IF('P1'!B55=\"\",\"\",'P1'!B55)","v":""},{"$f":"IF('P2'!B55=\"\",\"\",'P2'!B55)","v":""},{"$f":"IF('P3'!B55=\"\",\"\",'P3'!B55)","v":""},{"$f":"IF('P4'!B55=\"\",\"\",'P4'!B55)","v":""},{"$f":"IF('P5'!B55=\"\",\"\",'P5'!B55)","v":""},{"$f":"IF('P6'!B55=\"\",\"\",'P6'!B55)","v":""},{"$f":"IF('P7'!B55=\"\",\"\",'P7'!B55)","v":""},{"$f":"IF('P8'!B55=\"\",\"\",'P8'!B55)","v":""},{"$f":"IF('P9'!B55=\"\",\"\",'P9'!B55)","v":""},{"$f":"IF('P10'!B55=\"\",\"\",'P10'!B55)","v":""},{"$f":"IF('P11'!B55=\"\",\"\",'P11'!B55)","v":""},{"$f":"IF('P12'!B55=\"\",\"\",'P12'!B55)","v":""}]
["Négociation",{"$f":"IF('P1'!B56=\"\",\"\",'P1'!B56)","v":""},{"$f":"IF('P2'!B56=\"\",\"\",'P2'!B56)","v":""},{"$f":"IF('P3'!B56=\"\",\"\",'P3'!B56)","v":""},{"$f":"IF('P4'!B56=\"\",\"\",'P4'!B56)","v":""},{"$f":"IF('P5'!B56=\"\",\"\",'P5'!B56)","v":""},{"$f":"IF('P6'!B56=\"\",\"\",'P6'!B56)","v":""},{"$f":"IF('P7'!B56=\"\",\"\",'P7'!B56)","v":""},{"$f":"IF('P8'!B56=\"\",\"\",'P8'!B56)","v":""},{"$f":"IF('P9'!B56=\"\",\"\",'P9'!B56)","v":""},{"$f":"IF('P10'!B56=\"\",\"\",'P10'!B56)","v":""},{"$f":"IF('P11'!B56=\"\",\"\",'P11'!B56)","v":""},{"$f":"IF('P12'!B56=\"\",\"\",'P12'!B56)","v":""}]
["Production",{"$f":"IF('P1'!B57=\"\",\"\",'P1'!B57)","v":""},{"$f":"IF('P2'!B57=\"\",\"\",'P2'!B57)","v":""},{"$f":"IF('P3'!B57=\"\",\"\",'P3'!B57)","v":""},{"$f":"IF('P4'!B57=\"\",\"\",'P4'!B57)","v":""},{"$f":"IF('P5'!B57=\"\",\"\",'P5'!B57)","v":""},{"$f":"IF('P6'!B57=\"\",\"\",'P6'!B57)","v":""},{"$f":"IF('P7'!B57=\"\",\"\",'P7'!B57)","v":""},{"$f":"IF('P8'!B57=\"\",\"\",'P8'!B57)","v":""},{"$f":"IF('P9'!B57=\"\",\"\",'P9'!B57)","v":""},{"$f":"IF('P10'!B57=\"\",\"\",'P10'!B57)","v":""},{"$f":"IF('P11'!B57=\"\",\"\",'P11'!B57)","v":""},{"$f":"IF('P12'!B57=\"\",\"\",'P12'!B57)","v":""}]
["Distribution",{"$f":"IF('P1'!B58=\"\",\"\",'P1'!B58)","v":""},{"$f":"IF('P2'!B58=\"\",\"\",'P2'!B58)","v":""},{"$f":"IF('P3'!B58=\"\",\"\",'P3'!B58)","v":""},{"$f":"IF('P4'!B58=\"\",\"\",'P4'!B58)","v":""},{"$f":"IF('P5'!B58=\"\",\"\",'P5'!B58)","v":""},{"$f":"IF('P6'!B58=\"\",\"\",'P6'!B58)","v":""},{"$f":"IF('P7'!B58=\"\",\"\",'P7'!B58)","v":""},{"$f":"IF('P8'!B58=\"\",\"\",'P8'!B58)","v":""},{"$f":"IF('P9'!B58=\"\",\"\",'P9'!B58)","v":""},{"$f":"IF('P10'!B58=\"\",\"\",'P10'!B58)","v":""},{"$f":"IF('P11'!B58=\"\",\"\",'P11'!B58)","v":""},{"$f":"IF('P12'!B58=\"\",\"\",'P12'!B58)","v":""}]
["Juridique",{"$f":"IF('P1'!B59=\"\",\"\",'P1'!B59)","v":""},{"$f":"IF('P2'!B59=\"\",\"\",'P2'!B59)","v":""},{"$f":"IF('P3'!B59=\"\",\"\",'P3'!B59)","v":""},{"$f":"IF('P4'!B59=\"\",\"\",'P4'!B59)","v":""},{"$f":"IF('P5'!B59=\"\",\"\",'P5'!B59)","v":""},{"$f":"IF('P6'!B59=\"\",\"\",'P6'!B59)","v":""},{"$f":"IF('P7'!B59=\"\",\"\",'P7'!B59)","v":""},{"$f":"IF('P8'!B59=\"\",\"\",'P8'!B59)","v":""},{"$f":"IF('P9'!B59=\"\",\"\",'P9'!B59)","v":""},{"$f":"IF('P10'!B59=\"\",\"\",'P10'!B59)","v":""},{"$f":"IF('P11'!B59=\"\",\"\",'P11'!B59)","v":""},{"$f":"IF('P12'!B59=\"\",\"\",'P12'!B59)","v":""}]
["8. Gestion financière et des coûts",{"$f":"IF('P1'!B60=\"\",\"\",'P1'!B60)","v":""},{"$f":"IF('P2'!B60=\"\",\"\",'P2'!B60)","v":""},{"$f":"IF('P3'!B60=\"\",\"\",'P3'!B60)","v":""},{"$f":"IF('P4'!B60=\"\",\"\",'P4'!B60)","v":""},{"$f":"IF('P5'!B60=\"\",\"\",'P5'!B60)","v":""},{"$f":"IF('P6'!B60=\"\",\"\",'P6'!B60)","v":""},{"$f":"IF('P7'!B60=\"\",\"\",'P7'!B60)","v":""},{"$f":"IF('P8'!B60=\"\",\"\",'P8'!B60)","v":""},{"$f":"IF('P9'!B60=\"\",\"\",'P9'!B60)","v":""},{"$f":"IF('P10'!B60=\"\",\"\",'P10'!B60)","v":""},{"$f":"IF('P11'!B60=\"\",\"\",'P11'!B60)","v":""},{"$f":"IF('P12'!B60=\"\",\"\",'P12'!B60)","v":""}]
["Point mort ",{"$f":"IF('P1'!B61=\"\",\"\",'P1'!B61)","v":""},{"$f":"IF('P2'!B61=\"\",\"\",'P2'!B61)","v":""},{"$f":"IF('P3'!B61=\"\",\"\",'P3'!B61)","v":""},{"$f":"IF('P4'!B61=\"\",\"\",'P4'!B61)","v":""},{"$f":"IF('P5'!B61=\"\",\"\",'P5'!B61)","v":""},{"$f":"IF('P6'!B61=\"\",\"\",'P6'!B61)","v":""},{"$f":"IF('P7'!B61=\"\",\"\",'P7'!B61)","v":""},{"$f":"IF('P8'!B61=\"\",\"\",'P8'!B61)","v":""},{"$f":"IF('P9'!B61=\"\",\"\",'P9'!B61)","v":""},{"$f":"IF('P10'!B61=\"\",\"\",'P10'!B61)","v":""},{"$f":"IF('P11'!B61=\"\",\"\",'P11'!B61)","v":""},{"$f":"IF('P12'!B61=\"\",\"\",'P12'!B61)","v":""}]
["Planification financière ",{"$f":"IF('P1'!B62=\"\",\"\",'P1'!B62)","v":""},{"$f":"IF('P2'!B62=\"\",\"\",'P2'!B62)","v":""},{"$f":"IF('P3'!B62=\"\",\"\",'P3'!B62)","v":""},{"$f":"IF('P4'!B62=\"\",\"\",'P4'!B62)","v":""},{"$f":"IF('P5'!B62=\"\",\"\",'P5'!B62)","v":""},{"$f":"IF('P6'!B62=\"\",\"\",'P6'!B62)","v":""},{"$f":"IF('P7'!B62=\"\",\"\",'P7'!B62)","v":""},{"$f":"IF('P8'!B62=\"\",\"\",'P8'!B62)","v":""},{"$f":"IF('P9'!B62=\"\",\"\",'P9'!B62)","v":""},{"$f":"IF('P10'!B62=\"\",\"\",'P10'!B62)","v":""},{"$f":"IF('P11'!B62=\"\",\"\",'P11'!B62)","v":""},{"$f":"IF('P12'!B62=\"\",\"\",'P12'!B62)","v":""}]
["Budget ",{"$f":"IF('P1'!B63=\"\",\"\",'P1'!B63)","v":""},{"$f":"IF('P2'!B63=\"\",\"\",'P2'!B63)","v":""},{"$f":"IF('P3'!B63=\"\",\"\",'P3'!B63)","v":""},{"$f":"IF('P4'!B63=\"\",\"\",'P4'!B63)","v":""},{"$f":"IF('P5'!B63=\"\",\"\",'P5'!B63)","v":""},{"$f":"IF('P6'!B63=\"\",\"\",'P6'!B63)","v":""},{"$f":"IF('P7'!B63=\"\",\"\",'P7'!B63)","v":""},{"$f":"IF('P8'!B63=\"\",\"\",'P8'!B63)","v":""},{"$f":"IF('P9'!B63=\"\",\"\",'P9'!B63)","v":""},{"$f":"IF('P10'!B63=\"\",\"\",'P10'!B63)","v":""},{"$f":"IF('P11'!B63=\"\",\"\",'P11'!B63)","v":""},{"$f":"IF('P12'!B63=\"\",\"\",'P12'!B63)","v":""}]
["Créanciers et débiteurs ",{"$f":"IF('P1'!B64=\"\",\"\",'P1'!B64)","v":""},{"$f":"IF('P2'!B64=\"\",\"\",'P2'!B64)","v":""},{"$f":"IF('P3'!B64=\"\",\"\",'P3'!B64)","v":""},{"$f":"IF('P4'!B64=\"\",\"\",'P4'!B64)","v":""},{"$f":"IF('P5'!B64=\"\",\"\",'P5'!B64)","v":""},{"$f":"IF('P6'!B64=\"\",\"\",'P6'!B64)","v":""},{"$f":"IF('P7'!B64=\"\",\"\",'P7'!B64)","v":""},{"$f":"IF('P8'!B64=\"\",\"\",'P8'!B64)","v":""},{"$f":"IF('P9'!B64=\"\",\"\",'P9'!B64)","v":""},{"$f":"IF('P10'!B64=\"\",\"\",'P10'!B64)","v":""},{"$f":"IF('P11'!B64=\"\",\"\",'P11'!B64)","v":""},{"$f":"IF('P12'!B64=\"\",\"\",'P12'!B64)","v":""}]
["Trésorerie ",{"$f":"IF('P1'!B65=\"\",\"\",'P1'!B65)","v":""},{"$f":"IF('P2'!B65=\"\",\"\",'P2'!B65)","v":""},{"$f":"IF('P3'!B65=\"\",\"\",'P3'!B65)","v":""},{"$f":"IF('P4'!B65=\"\",\"\",'P4'!B65)","v":""},{"$f":"IF('P5'!B65=\"\",\"\",'P5'!B65)","v":""},{"$f":"IF('P6'!B65=\"\",\"\",'P6'!B65)","v":""},{"$f":"IF('P7'!B65=\"\",\"\",'P7'!B65)","v":""},{"$f":"IF('P8'!B65=\"\",\"\",'P8'!B65)","v":""},{"$f":"IF('P9'!B65=\"\",\"\",'P9'!B65)","v":""},{"$f":"IF('P10'!B65=\"\",\"\",'P10'!B65)","v":""},{"$f":"IF('P11'!B65=\"\",\"\",'P11'!B65)","v":""},{"$f":"IF('P12'!B65=\"\",\"\",'P12'!B65)","v":""}]
["Prise de décision ",{"$f":"IF('P1'!B66=\"\",\"\",'P1'!B66)","v":""},{"$f":"IF('P2'!B66=\"\",\"\",'P2'!B66)","v":""},{"$f":"IF('P3'!B66=\"\",\"\",'P3'!B66)","v":""},{"$f":"IF('P4'!B66=\"\",\"\",'P4'!B66)","v":""},{"$f":"IF('P5'!B66=\"\",\"\",'P5'!B66)","v":""},{"$f":"IF('P6'!B66=\"\",\"\",'P6'!B66)","v":""},{"$f":"IF('P7'!B66=\"\",\"\",'P7'!B66)","v":""},{"$f":"IF('P8'!B66=\"\",\"\",'P8'!B66)","v":""},{"$f":"IF('P9'!B66=\"\",\"\",'P9'!B66)","v":""},{"$f":"IF('P10'!B66=\"\",\"\",'P10'!B66)","v":""},{"$f":"IF('P11'!B66=\"\",\"\",'P11'!B66)","v":""},{"$f":"IF('P12'!B66=\"\",\"\",'P12'!B66)","v":""}]
["Relations financières ",{"$f":"IF('P1'!B67=\"\",\"\",'P1'!B67)","v":""},{"$f":"IF('P2'!B67=\"\",\"\",'P2'!B67)","v":""},{"$f":"IF('P3'!B67=\"\",\"\",'P3'!B67)","v":""},{"$f":"IF('P4'!B67=\"\",\"\",'P4'!B67)","v":""},{"$f":"IF('P5'!B67=\"\",\"\",'P5'!B67)","v":""},{"$f":"IF('P6'!B67=\"\",\"\",'P6'!B67)","v":""},{"$f":"IF('P7'!B67=\"\",\"\",'P7'!B67)","v":""},{"$f":"IF('P8'!B67=\"\",\"\",'P8'!B67)","v":""},{"$f":"IF('P9'!B67=\"\",\"\",'P9'!B67)","v":""},{"$f":"IF('P10'!B67=\"\",\"\",'P10'!B67)","v":""},{"$f":"IF('P11'!B67=\"\",\"\",'P11'!B67)","v":""},{"$f":"IF('P12'!B67=\"\",\"\",'P12'!B67)","v":""}]
["Recherche de fonds et investisseurs",{"$f":"IF('P1'!B68=\"\",\"\",'P1'!B68)","v":""},{"$f":"IF('P2'!B68=\"\",\"\",'P2'!B68)","v":""},{"$f":"IF('P3'!B68=\"\",\"\",'P3'!B68)","v":""},{"$f":"IF('P4'!B68=\"\",\"\",'P4'!B68)","v":""},{"$f":"IF('P5'!B68=\"\",\"\",'P5'!B68)","v":""},{"$f":"IF('P6'!B68=\"\",\"\",'P6'!B68)","v":""},{"$f":"IF('P7'!B68=\"\",\"\",'P7'!B68)","v":""},{"$f":"IF('P8'!B68=\"\",\"\",'P8'!B68)","v":""},{"$f":"IF('P9'!B68=\"\",\"\",'P9'!B68)","v":""},{"$f":"IF('P10'!B68=\"\",\"\",'P10'!B68)","v":""},{"$f":"IF('P11'!B68=\"\",\"\",'P11'!B68)","v":""},{"$f":"IF('P12'!B68=\"\",\"\",'P12'!B68)","v":""}]
["9. Gestion des RH et gouvernance interne",{"$f":"IF('P1'!B69=\"\",\"\",'P1'!B69)","v":""},{"$f":"IF('P2'!B69=\"\",\"\",'P2'!B69)","v":""},{"$f":"IF('P3'!B69=\"\",\"\",'P3'!B69)","v":""},{"$f":"IF('P4'!B69=\"\",\"\",'P4'!B69)","v":""},{"$f":"IF('P5'!B69=\"\",\"\",'P5'!B69)","v":""},{"$f":"IF('P6'!B69=\"\",\"\",'P6'!B69)","v":""},{"$f":"IF('P7'!B69=\"\",\"\",'P7'!B69)","v":""},{"$f":"IF('P8'!B69=\"\",\"\",'P8'!B69)","v":""},{"$f":"IF('P9'!B69=\"\",\"\",'P9'!B69)","v":""},{"$f":"IF('P10'!B69=\"\",\"\",'P10'!B69)","v":""},{"$f":"IF('P11'!B69=\"\",\"\",'P11'!B69)","v":""},{"$f":"IF('P12'!B69=\"\",\"\",'P12'!B69)","v":""}]
["Politique RH",{"$f":"IF('P1'!B70=\"\",\"\",'P1'!B70)","v":""},{"$f":"IF('P2'!B70=\"\",\"\",'P2'!B70)","v":""},{"$f":"IF('P3'!B70=\"\",\"\",'P3'!B70)","v":""},{"$f":"IF('P4'!B70=\"\",\"\",'P4'!B70)","v":""},{"$f":"IF('P5'!B70=\"\",\"\",'P5'!B70)","v":""},{"$f":"IF('P6'!B70=\"\",\"\",'P6'!B70)","v":""},{"$f":"IF('P7'!B70=\"\",\"\",'P7'!B70)","v":""},{"$f":"IF('P8'!B70=\"\",\"\",'P8'!B70)","v":""},{"$f":"IF('P9'!B70=\"\",\"\",'P9'!B70)","v":""},{"$f":"IF('P10'!B70=\"\",\"\",'P10'!B70)","v":""},{"$f":"IF('P11'!B70=\"\",\"\",'P11'!B70)","v":""},{"$f":"IF('P12'!B70=\"\",\"\",'P12'!B70)","v":""}]
["Gestion RH",{"$f":"IF('P1'!B71=\"\",\"\",'P1'!B71)","v":""},{"$f":"IF('P2'!B71=\"\",\"\",'P2'!B71)","v":""},{"$f":"IF('P3'!B71=\"\",\"\",'P3'!B71)","v":""},{"$f":"IF('P4'!B71=\"\",\"\",'P4'!B71)","v":""},{"$f":"IF('P5'!B71=\"\",\"\",'P5'!B71)","v":""},{"$f":"IF('P6'!B71=\"\",\"\",'P6'!B71)","v":""},{"$f":"IF('P7'!B71=\"\",\"\",'P7'!B71)","v":""},{"$f":"IF('P8'!B71=\"\",\"\",'P8'!B71)","v":""},{"$f":"IF('P9'!B71=\"\",\"\",'P9'!B71)","v":""},{"$f":"IF('P10'!B71=\"\",\"\",'P10'!B71)","v":""},{"$f":"IF('P11'!B71=\"\",\"\",'P11'!B71)","v":""},{"$f":"IF('P12'!B71=\"\",\"\",'P12'!B71)","v":""}]
["Cahiers des charges",{"$f":"IF('P1'!B72=\"\",\"\",'P1'!B72)","v":""},{"$f":"IF('P2'!B72=\"\",\"\",'P2'!B72)","v":""},{"$f":"IF('P3'!B72=\"\",\"\",'P3'!B72)","v":""},{"$f":"IF('P4'!B72=\"\",\"\",'P4'!B72)","v":""},{"$f":"IF('P5'!B72=\"\",\"\",'P5'!B72)","v":""},{"$f":"IF('P6'!B72=\"\",\"\",'P6'!B72)","v":""},{"$f":"IF('P7'!B72=\"\",\"\",'P7'!B72)","v":""},{"$f":"IF('P8'!B72=\"\",\"\",'P8'!B72)","v":""},{"$f":"IF('P9'!B72=\"\",\"\",'P9'!B72)","v":""},{"$f":"IF('P10'!B72=\"\",\"\",'P10'!B72)","v":""},{"$f":"IF('P11'!B72=\"\",\"\",'P11'!B72)","v":""},{"$f":"IF('P12'!B72=\"\",\"\",'P12'!B72)","v":""}]
["Management",{"$f":"IF('P1'!B73=\"\",\"\",'P1'!B73)","v":""},{"$f":"IF('P2'!B73=\"\",\"\",'P2'!B73)","v":""},{"$f":"IF('P3'!B73=\"\",\"\",'P3'!B73)","v":""},{"$f":"IF('P4'!B73=\"\",\"\",'P4'!B73)","v":""},{"$f":"IF('P5'!B73=\"\",\"\",'P5'!B73)","v":""},{"$f":"IF('P6'!B73=\"\",\"\",'P6'!B73)","v":""},{"$f":"IF('P7'!B73=\"\",\"\",'P7'!B73)","v":""},{"$f":"IF('P8'!B73=\"\",\"\",'P8'!B73)","v":""},{"$f":"IF('P9'!B73=\"\",\"\",'P9'!B73)","v":""},{"$f":"IF('P10'!B73=\"\",\"\",'P10'!B73)","v":""},{"$f":"IF('P11'!B73=\"\",\"\",'P11'!B73)","v":""},{"$f":"IF('P12'!B73=\"\",\"\",'P12'!B73)","v":""}]
["Leadership",{"$f":"IF('P1'!B74=\"\",\"\",'P1'!B74)","v":""},{"$f":"IF('P2'!B74=\"\",\"\",'P2'!B74)","v":""},{"$f":"IF('P3'!B74=\"\",\"\",'P3'!B74)","v":""},{"$f":"IF('P4'!B74=\"\",\"\",'P4'!B74)","v":""},{"$f":"IF('P5'!B74=\"\",\"\",'P5'!B74)","v":""},{"$f":"IF('P6'!B74=\"\",\"\",'P6'!B74)","v":""},{"$f":"IF('P7'!B74=\"\",\"\",'P7'!B74)","v":""},{"$f":"IF('P8'!B74=\"\",\"\",'P8'!B74)","v":""},{"$f":"IF('P9'!B74=\"\",\"\",'P9'!B74)","v":""},{"$f":"IF('P10'!B74=\"\",\"\",'P10'!B74)","v":""},{"$f":"IF('P11'!B74=\"\",\"\",'P11'!B74)","v":""},{"$f":"IF('P12'!B74=\"\",\"\",'P12'!B74)","v":""}]
["Participation",{"$f":"IF('P1'!B75=\"\",\"\",'P1'!B75)","v":""},{"$f":"IF('P2'!B75=\"\",\"\",'P2'!B75)","v":""},{"$f":"IF('P3'!B75=\"\",\"\",'P3'!B75)","v":""},{"$f":"IF('P4'!B75=\"\",\"\",'P4'!B75)","v":""},{"$f":"IF('P5'!B75=\"\",\"\",'P5'!B75)","v":""},{"$f":"IF('P6'!B75=\"\",\"\",'P6'!B75)","v":""},{"$f":"IF('P7'!B75=\"\",\"\",'P7'!B75)","v":""},{"$f":"IF('P8'!B75=\"\",\"\",'P8'!B75)","v":""},{"$f":"IF('P9'!B75=\"\",\"\",'P9'!B75)","v":""},{"$f":"IF('P10'!B75=\"\",\"\",'P10'!B75)","v":""},{"$f":"IF('P11'!B75=\"\",\"\",'P11'!B75)","v":""},{"$f":"IF('P12'!B75=\"\",\"\",'P12'!B75)","v":""}]
["Gestion de conflits",{"$f":"IF('P1'!B76=\"\",\"\",'P1'!B76)","v":""},{"$f":"IF('P2'!B76=\"\",\"\",'P2'!B76)","v":""},{"$f":"IF('P3'!B76=\"\",\"\",'P3'!B76)","v":""},{"$f":"IF('P4'!B76=\"\",\"\",'P4'!B76)","v":""},{"$f":"IF('P5'!B76=\"\",\"\",'P5'!B76)","v":""},{"$f":"IF('P6'!B76=\"\",\"\",'P6'!B76)","v":""},{"$f":"IF('P7'!B76=\"\",\"\",'P7'!B76)","v":""},{"$f":"IF('P8'!B76=\"\",\"\",'P8'!B76)","v":""},{"$f":"IF('P9'!B76=\"\",\"\",'P9'!B76)","v":""},{"$f":"IF('P10'!B76=\"\",\"\",'P10'!B76)","v":""},{"$f":"IF('P11'!B76=\"\",\"\",'P11'!B76)","v":""},{"$f":"IF('P12'!B76=\"\",\"\",'P12'!B76)","v":""}]
[null,{"$f":"IF('P1'!B77=\"\",\"\",'P1'!B77)","v":""},{"$f":"IF('P2'!B77=\"\",\"\",'P2'!B77)","v":""},{"$f":"IF('P3'!B77=\"\",\"\",'P3'!B77)","v":""},{"$f":"IF('P4'!B77=\"\",\"\",'P4'!B77)","v":""},{"$f":"IF('P5'!B77=\"\",\"\",'P5'!B77)","v":""},{"$f":"IF('P6'!B77=\"\",\"\",'P6'!B77)","v":""},{"$f":"IF('P7'!B77=\"\",\"\",'P7'!B77)","v":""},{"$f":"IF('P8'!B77=\"\",\"\",'P8'!B77)","v":""},{"$f":"IF('P9'!B77=\"\",\"\",'P9'!B77)","v":""},{"$f":"IF('P10'!B77=\"\",\"\",'P10'!B77)","v":""},{"$f":"IF('P11'!B77=\"\",\"\",'P11'!B77)","v":""},{"$f":"IF('P12'!B77=\"\",\"\",'P12'!B77)","v":""}]
[null,{"$f":"IF('P1'!B78=\"\",\"\",'P1'!B78)","v":""},{"$f":"IF('P2'!B78=\"\",\"\",'P2'!B78)","v":""},{"$f":"IF('P3'!B78=\"\",\"\",'P3'!B78)","v":""},{"$f":"IF('P4'!B78=\"\",\"\",'P4'!B78)","v":""},{"$f":"IF('P5'!B78=\"\",\"\",'P5'!B78)","v":""},{"$f":"IF('P6'!B78=\"\",\"\",'P6'!B78)","v":""},{"$f":"IF('P7'!B78=\"\",\"\",'P7'!B78)","v":""},{"$f":"IF('P8'!B78=\"\",\"\",'P8'!B78)","v":""},{"$f":"IF('P9'!B78=\"\",\"\",'P9'!B78)","v":""},{"$f":"IF('P10'!B78=\"\",\"\",'P10'!B78)","v":""},{"$f":"IF('P11'!B78=\"\",\"\",'P11'!B78)","v":""},{"$f":"IF('P12'!B78=\"\",\"\",'P12'!B78)","v":""}]
[null,{"$f":"IF('P1'!B79=\"\",\"\",'P1'!B79)","v":""},{"$f":"IF('P2'!B79=\"\",\"\",'P2'!B79)","v":""},{"$f":"IF('P3'!B79=\"\",\"\",'P3'!B79)","v":""},{"$f":"IF('P4'!B79=\"\",\"\",'P4'!B79)","v":""},{"$f":"IF('P5'!B79=\"\",\"\",'P5'!B79)","v":""},{"$f":"IF('P6'!B79=\"\",\"\",'P6'!B79)","v":""},{"$f":"IF('P7'!B79=\"\",\"\",'P7'!B79)","v":""},{"$f":"IF('P8'!B79=\"\",\"\",'P8'!B79)","v":""},{"$f":"IF('P9'!B79=\"\",\"\",'P9'!B79)","v":""},{"$f":"IF('P10'!B79=\"\",\"\",'P10'!B79)","v":""},{"$f":"IF('P11'!B79=\"\",\"\",'P11'!B79)","v":""},{"$f":"IF('P12'!B79=\"\",\"\",'P12'!B79)","v":""}]
[null,{"$f":"IF('P1'!B80=\"\",\"\",'P1'!B80)","v":""},{"$f":"IF('P2'!B80=\"\",\"\",'P2'!B80)","v":""},{"$f":"IF('P3'!B80=\"\",\"\",'P3'!B80)","v":""},{"$f":"IF('P4'!B80=\"\",\"\",'P4'!B80)","v":""},{"$f":"IF('P5'!B80=\"\",\"\",'P5'!B80)","v":""},{"$f":"IF('P6'!B80=\"\",\"\",'P6'!B80)","v":""},{"$f":"IF('P7'!B80=\"\",\"\",'P7'!B80)","v":""},{"$f":"IF('P8'!B80=\"\",\"\",'P8'!B80)","v":""},{"$f":"IF('P9'!B80=\"\",\"\",'P9'!B80)","v":""},{"$f":"IF('P10'!B80=\"\",\"\",'P10'!B80)","v":""},{"$f":"IF('P11'!B80=\"\",\"\",'P11'!B80)","v":""},{"$f":"IF('P12'!B80=\"\",\"\",'P12'!B80)","v":""}]
[null,{"$f":"IF('P1'!B81=\"\",\"\",'P1'!B81)","v":""},{"$f":"IF('P2'!B81=\"\",\"\",'P2'!B81)","v":""},{"$f":"IF('P3'!B81=\"\",\"\",'P3'!B81)","v":""},{"$f":"IF('P4'!B81=\"\",\"\",'P4'!B81)","v":""},{"$f":"IF('P5'!B81=\"\",\"\",'P5'!B81)","v":""},{"$f":"IF('P6'!B81=\"\",\"\",'P6'!B81)","v":""},{"$f":"IF('P7'!B81=\"\",\"\",'P7'!B81)","v":""},{"$f":"IF('P8'!B81=\"\",\"\",'P8'!B81)","v":""},{"$f":"IF('P9'!B81=\"\",\"\",'P9'!B81)","v":""},{"$f":"IF('P10'!B81=\"\",\"\",'P10'!B81)","v":""},{"$f":"IF('P11'!B81=\"\",\"\",'P11'!B81)","v":""},{"$f":"IF('P12'!B81=\"\",\"\",'P12'!B81)","v":""}]
[null,{"$f":"IF('P1'!B82=\"\",\"\",'P1'!B82)","v":""},{"$f":"IF('P2'!B82=\"\",\"\",'P2'!B82)","v":""},{"$f":"IF('P3'!B82=\"\",\"\",'P3'!B82)","v":""},{"$f":"IF('P4'!B82=\"\",\"\",'P4'!B82)","v":""},{"$f":"IF('P5'!B82=\"\",\"\",'P5'!B82)","v":""},{"$f":"IF('P6'!B82=\"\",\"\",'P6'!B82)","v":""},{"$f":"IF('P7'!B82=\"\",\"\",'P7'!B82)","v":""},{"$f":"IF('P8'!B82=\"\",\"\",'P8'!B82)","v":""},{"$f":"IF('P9'!B82=\"\",\"\",'P9'!B82)","v":""},{"$f":"IF('P10'!B82=\"\",\"\",'P10'!B82)","v":""},{"$f":"IF('P11'!B82=\"\",\"\",'P11'!B82)","v":""},{"$f":"IF('P12'!B82=\"\",\"\",'P12'!B82)","v":""}]
[null,{"$f":"IF('P1'!B83=\"\",\"\",'P1'!B83)","v":""},{"$f":"IF('P2'!B83=\"\",\"\",'P2'!B83)","v":""},{"$f":"IF('P3'!B83=\"\",\"\",'P3'!B83)","v":""},{"$f":"IF('P4'!B83=\"\",\"\",'P4'!B83)","v":""},{"$f":"IF('P5'!B83=\"\",\"\",'P5'!B83)","v":""},{"$f":"IF('P6'!B83=\"\",\"\",'P6'!B83)","v":""},{"$f":"IF('P7'!B83=\"\",\"\",'P7'!B83)","v":""},{"$f":"IF('P8'!B83=\"\",\"\",'P8'!B83)","v":""},{"$f":"IF('P9'!B83=\"\",\"\",'P9'!B83)","v":""},{"$f":"IF('P10'!B83=\"\",\"\",'P10'!B83)","v":""},{"$f":"IF('P11'!B83=\"\",\"\",'P11'!B83)","v":""},{"$f":"IF('P12'!B83=\"\",\"\",'P12'!B83)","v":""}]
[null,{"$f":"IF('P1'!B84=\"\",\"\",'P1'!B84)","v":""},{"$f":"IF('P2'!B84=\"\",\"\",'P2'!B84)","v":""},{"$f":"IF('P3'!B84=\"\",\"\",'P3'!B84)","v":""},{"$f":"IF('P4'!B84=\"\",\"\",'P4'!B84)","v":""},{"$f":"IF('P5'!B84=\"\",\"\",'P5'!B84)","v":""},{"$f":"IF('P6'!B84=\"\",\"\",'P6'!B84)","v":""},{"$f":"IF('P7'!B84=\"\",\"\",'P7'!B84)","v":""},{"$f":"IF('P8'!B84=\"\",\"\",'P8'!B84)","v":""},{"$f":"IF('P9'!B84=\"\",\"\",'P9'!B84)","v":""},{"$f":"IF('P10'!B84=\"\",\"\",'P10'!B84)","v":""},{"$f":"IF('P11'!B84=\"\",\"\",'P11'!B84)","v":""},{"$f":"IF('P12'!B84=\"\",\"\",'P12'!B84)","v":""}]
[null,{"$f":"IF('P1'!B85=\"\",\"\",'P1'!B85)","v":""},{"$f":"IF('P2'!B85=\"\",\"\",'P2'!B85)","v":""},{"$f":"IF('P3'!B85=\"\",\"\",'P3'!B85)","v":""},{"$f":"IF('P4'!B85=\"\",\"\",'P4'!B85)","v":""},{"$f":"IF('P5'!B85=\"\",\"\",'P5'!B85)","v":""},{"$f":"IF('P6'!B85=\"\",\"\",'P6'!B85)","v":""},{"$f":"IF('P7'!B85=\"\",\"\",'P7'!B85)","v":""},{"$f":"IF('P8'!B85=\"\",\"\",'P8'!B85)","v":""},{"$f":"IF('P9'!B85=\"\",\"\",'P9'!B85)","v":""},{"$f":"IF('P10'!B85=\"\",\"\",'P10'!B85)","v":""},{"$f":"IF('P11'!B85=\"\",\"\",'P11'!B85)","v":""},{"$f":"IF('P12'!B85=\"\",\"\",'P12'!B85)","v":""}]
[null,{"$f":"IF('P1'!B86=\"\",\"\",'P1'!B86)","v":""},{"$f":"IF('P2'!B86=\"\",\"\",'P2'!B86)","v":""},{"$f":"IF('P3'!B86=\"\",\"\",'P3'!B86)","v":""},{"$f":"IF('P4'!B86=\"\",\"\",'P4'!B86)","v":""},{"$f":"IF('P5'!B86=\"\",\"\",'P5'!B86)","v":""},{"$f":"IF('P6'!B86=\"\",\"\",'P6'!B86)","v":""},{"$f":"IF('P7'!B86=\"\",\"\",'P7'!B86)","v":""},{"$f":"IF('P8'!B86=\"\",\"\",'P8'!B86)","v":""},{"$f":"IF('P9'!B86=\"\",\"\",'P9'!B86)","v":""},{"$f":"IF('P10'!B86=\"\",\"\",'P10'!B86)","v":""},{"$f":"IF('P11'!B86=\"\",\"\",'P11'!B86)","v":""},{"$f":"IF('P12'!B86=\"\",\"\",'P12'!B86)","v":""}]
[null,{"$f":"IF('P1'!B87=\"\",\"\",'P1'!B87)","v":""},{"$f":"IF('P2'!B87=\"\",\"\",'P2'!B87)","v":""},{"$f":"IF('P3'!B87=\"\",\"\",'P3'!B87)","v":""},{"$f":"IF('P4'!B87=\"\",\"\",'P4'!B87)","v":""},{"$f":"IF('P5'!B87=\"\",\"\",'P5'!B87)","v":""},{"$f":"IF('P6'!B87=\"\",\"\",'P6'!B87)","v":""},{"$f":"IF('P7'!B87=\"\",\"\",'P7'!B87)","v":""},{"$f":"IF('P8'!B87=\"\",\"\",'P8'!B87)","v":""},{"$f":"IF('P9'!B87=\"\",\"\",'P9'!B87)","v":""},{"$f":"IF('P10'!B87=\"\",\"\",'P10'!B87)","v":""},{"$f":"IF('P11'!B87=\"\",\"\",'P11'!B87)","v":""},{"$f":"IF('P12'!B87=\"\",\"\",'P12'!B87)","v":""}]
[null,{"$f":"IF('P1'!B88=\"\",\"\",'P1'!B88)","v":""},{"$f":"IF('P2'!B88=\"\",\"\",'P2'!B88)","v":""},{"$f":"IF('P3'!B88=\"\",\"\",'P3'!B88)","v":""},{"$f":"IF('P4'!B88=\"\",\"\",'P4'!B88)","v":""},{"$f":"IF('P5'!B88=\"\",\"\",'P5'!B88)","v":""},{"$f":"IF('P6'!B88=\"\",\"\",'P6'!B88)","v":""},{"$f":"IF('P7'!B88=\"\",\"\",'P7'!B88)","v":""},{"$f":"IF('P8'!B88=\"\",\"\",'P8'!B88)","v":""},{"$f":"IF('P9'!B88=\"\",\"\",'P9'!B88)","v":""},{"$f":"IF('P10'!B88=\"\",\"\",'P10'!B88)","v":""},{"$f":"IF('P11'!B88=\"\",\"\",'P11'!B88)","v":""},{"$f":"IF('P12'!B88=\"\",\"\",'P12'!B88)","v":""}]
[null,{"$f":"IF('P1'!B89=\"\",\"\",'P1'!B89)","v":""},{"$f":"IF('P2'!B89=\"\",\"\",'P2'!B89)","v":""},{"$f":"IF('P3'!B89=\"\",\"\",'P3'!B89)","v":""},{"$f":"IF('P4'!B89=\"\",\"\",'P4'!B89)","v":""},{"$f":"IF('P5'!B89=\"\",\"\",'P5'!B89)","v":""},{"$f":"IF('P6'!B89=\"\",\"\",'P6'!B89)","v":""},{"$f":"IF('P7'!B89=\"\",\"\",'P7'!B89)","v":""},{"$f":"IF('P8'!B89=\"\",\"\",'P8'!B89)","v":""},{"$f":"IF('P9'!B89=\"\",\"\",'P9'!B89)","v":""},{"$f":"IF('P10'!B89=\"\",\"\",'P10'!B89)","v":""},{"$f":"IF('P11'!B89=\"\",\"\",'P11'!B89)","v":""},{"$f":"IF('P12'!B89=\"\",\"\",'P12'!B89)","v":""}]
[null,{"$f":"IF('P1'!B90=\"\",\"\",'P1'!B90)","v":""},{"$f":"IF('P2'!B90=\"\",\"\",'P2'!B90)","v":""},{"$f":"IF('P3'!B90=\"\",\"\",'P3'!B90)","v":""},{"$f":"IF('P4'!B90=\"\",\"\",'P4'!B90)","v":""},{"$f":"IF('P5'!B90=\"\",\"\",'P5'!B90)","v":""},{"$f":"IF('P6'!B90=\"\",\"\",'P6'!B90)","v":""},{"$f":"IF('P7'!B90=\"\",\"\",'P7'!B90)","v":""},{"$f":"IF('P8'!B90=\"\",\"\",'P8'!B90)","v":""},{"$f":"IF('P9'!B90=\"\",\"\",'P9'!B90)","v":""},{"$f":"IF('P10'!B90=\"\",\"\",'P10'!B90)","v":""},{"$f":"IF('P11'!B90=\"\",\"\",'P11'!B90)","v":""},{"$f":"IF('P12'!B90=\"\",\"\",'P12'!B90)","v":""}]
[null,{"$f":"IF('P1'!B91=\"\",\"\",'P1'!B91)","v":""},{"$f":"IF('P2'!B91=\"\",\"\",'P2'!B91)","v":""},{"$f":"IF('P3'!B91=\"\",\"\",'P3'!B91)","v":""},{"$f":"IF('P4'!B91=\"\",\"\",'P4'!B91)","v":""},{"$f":"IF('P5'!B91=\"\",\"\",'P5'!B91)","v":""},{"$f":"IF('P6'!B91=\"\",\"\",'P6'!B91)","v":""},{"$f":"IF('P7'!B91=\"\",\"\",'P7'!B91)","v":""},{"$f":"IF('P8'!B91=\"\",\"\",'P8'!B91)","v":""},{"$f":"IF('P9'!B91=\"\",\"\",'P9'!B91)","v":""},{"$f":"IF('P10'!B91=\"\",\"\",'P10'!B91)","v":""},{"$f":"IF('P11'!B91=\"\",\"\",'P11'!B91)","v":""},{"$f":"IF('P12'!B91=\"\",\"\",'P12'!B91)","v":""}]
[null,{"$f":"IF('P1'!B92=\"\",\"\",'P1'!B92)","v":""},{"$f":"IF('P2'!B92=\"\",\"\",'P2'!B92)","v":""},{"$f":"IF('P3'!B92=\"\",\"\",'P3'!B92)","v":""},{"$f":"IF('P4'!B92=\"\",\"\",'P4'!B92)","v":""},{"$f":"IF('P5'!B92=\"\",\"\",'P5'!B92)","v":""},{"$f":"IF('P6'!B92=\"\",\"\",'P6'!B92)","v":""},{"$f":"IF('P7'!B92=\"\",\"\",'P7'!B92)","v":""},{"$f":"IF('P8'!B92=\"\",\"\",'P8'!B92)","v":""},{"$f":"IF('P9'!B92=\"\",\"\",'P9'!B92)","v":""},{"$f":"IF('P10'!B92=\"\",\"\",'P10'!B92)","v":""},{"$f":"IF('P11'!B92=\"\",\"\",'P11'!B92)","v":""},{"$f":"IF('P12'!B92=\"\",\"\",'P12'!B92)","v":""}]
[null,{"$f":"IF('P1'!B93=\"\",\"\",'P1'!B93)","v":""},{"$f":"IF('P2'!B93=\"\",\"\",'P2'!B93)","v":""},{"$f":"IF('P3'!B93=\"\",\"\",'P3'!B93)","v":""},{"$f":"IF('P4'!B93=\"\",\"\",'P4'!B93)","v":""},{"$f":"IF('P5'!B93=\"\",\"\",'P5'!B93)","v":""},{"$f":"IF('P6'!B93=\"\",\"\",'P6'!B93)","v":""},{"$f":"IF('P7'!B93=\"\",\"\",'P7'!B93)","v":""},{"$f":"IF('P8'!B93=\"\",\"\",'P8'!B93)","v":""},{"$f":"IF('P9'!B93=\"\",\"\",'P9'!B93)","v":""},{"$f":"IF('P10'!B93=\"\",\"\",'P10'!B93)","v":""},{"$f":"IF('P11'!B93=\"\",\"\",'P11'!B93)","v":""},{"$f":"IF('P12'!B93=\"\",\"\",'P12'!B93)","v":""}]
[null,{"$f":"IF('P1'!B94=\"\",\"\",'P1'!B94)","v":""},{"$f":"IF('P2'!B94=\"\",\"\",'P2'!B94)","v":""},{"$f":"IF('P3'!B94=\"\",\"\",'P3'!B94)","v":""},{"$f":"IF('P4'!B94=\"\",\"\",'P4'!B94)","v":""},{"$f":"IF('P5'!B94=\"\",\"\",'P5'!B94)","v":""},{"$f":"IF('P6'!B94=\"\",\"\",'P6'!B94)","v":""},{"$f":"IF('P7'!B94=\"\",\"\",'P7'!B94)","v":""},{"$f":"IF('P8'!B94=\"\",\"\",'P8'!B94)","v":""},{"$f":"IF('P9'!B94=\"\",\"\",'P9'!B94)","v":""},{"$f":"IF('P10'!B94=\"\",\"\",'P10'!B94)","v":""},{"$f":"IF('P11'!B94=\"\",\"\",'P11'!B94)","v":""},{"$f":"IF('P12'!B94=\"\",\"\",'P12'!B94)","v":""}]
[null,{"$f":"IF('P1'!B95=\"\",\"\",'P1'!B95)","v":""},{"$f":"IF('P2'!B95=\"\",\"\",'P2'!B95)","v":""},{"$f":"IF('P3'!B95=\"\",\"\",'P3'!B95)","v":""},{"$f":"IF('P4'!B95=\"\",\"\",'P4'!B95)","v":""},{"$f":"IF('P5'!B95=\"\",\"\",'P5'!B95)","v":""},{"$f":"IF('P6'!B95=\"\",\"\",'P6'!B95)","v":""},{"$f":"IF('P7'!B95=\"\",\"\",'P7'!B95)","v":""},{"$f":"IF('P8'!B95=\"\",\"\",'P8'!B95)","v":""},{"$f":"IF('P9'!B95=\"\",\"\",'P9'!B95)","v":""},{"$f":"IF('P10'!B95=\"\",\"\",'P10'!B95)","v":""},{"$f":"IF('P11'!B95=\"\",\"\",'P11'!B95)","v":""},{"$f":"IF('P12'!B95=\"\",\"\",'P12'!B95)","v":""}]
[null,{"$f":"IF('P1'!B96=\"\",\"\",'P1'!B96)","v":""},{"$f":"IF('P2'!B96=\"\",\"\",'P2'!B96)","v":""},{"$f":"IF('P3'!B96=\"\",\"\",'P3'!B96)","v":""},{"$f":"IF('P4'!B96=\"\",\"\",'P4'!B96)","v":""},{"$f":"IF('P5'!B96=\"\",\"\",'P5'!B96)","v":""},{"$f":"IF('P6'!B96=\"\",\"\",'P6'!B96)","v":""},{"$f":"IF('P7'!B96=\"\",\"\",'P7'!B96)","v":""},{"$f":"IF('P8'!B96=\"\",\"\",'P8'!B96)","v":""},{"$f":"IF('P9'!B96=\"\",\"\",'P9'!B96)","v":""},{"$f":"IF('P10'!B96=\"\",\"\",'P10'!B96)","v":""},{"$f":"IF('P11'!B96=\"\",\"\",'P11'!B96)","v":""},{"$f":"IF('P12'!B96=\"\",\"\",'P12'!B96)","v":""}]
[null,{"$f":"IF('P1'!B97=\"\",\"\",'P1'!B97)","v":""},{"$f":"IF('P2'!B97=\"\",\"\",'P2'!B97)","v":""},{"$f":"IF('P3'!B97=\"\",\"\",'P3'!B97)","v":""},{"$f":"IF('P4'!B97=\"\",\"\",'P4'!B97)","v":""},{"$f":"IF('P5'!B97=\"\",\"\",'P5'!B97)","v":""},{"$f":"IF('P6'!B97=\"\",\"\",'P6'!B97)","v":""},{"$f":"IF('P7'!B97=\"\",\"\",'P7'!B97)","v":""},{"$f":"IF('P8'!B97=\"\",\"\",'P8'!B97)","v":""},{"$f":"IF('P9'!B97=\"\",\"\",'P9'!B97)","v":""},{"$f":"IF('P10'!B97=\"\",\"\",'P10'!B97)","v":""},{"$f":"IF('P11'!B97=\"\",\"\",'P11'!B97)","v":""},{"$f":"IF('P12'!B97=\"\",\"\",'P12'!B97)","v":""}]
[null,{"$f":"IF('P1'!B98=\"\",\"\",'P1'!B98)","v":""},{"$f":"IF('P2'!B98=\"\",\"\",'P2'!B98)","v":""},{"$f":"IF('P3'!B98=\"\",\"\",'P3'!B98)","v":""},{"$f":"IF('P4'!B98=\"\",\"\",'P4'!B98)","v":""},{"$f":"IF('P5'!B98=\"\",\"\",'P5'!B98)","v":""},{"$f":"IF('P6'!B98=\"\",\"\",'P6'!B98)","v":""},{"$f":"IF('P7'!B98=\"\",\"\",'P7'!B98)","v":""},{"$f":"IF('P8'!B98=\"\",\"\",'P8'!B98)","v":""},{"$f":"IF('P9'!B98=\"\",\"\",'P9'!B98)","v":""},{"$f":"IF('P10'!B98=\"\",\"\",'P10'!B98)","v":""},{"$f":"IF('P11'!B98=\"\",\"\",'P11'!B98)","v":""},{"$f":"IF('P12'!B98=\"\",\"\",'P12'!B98)","v":""}]
[null,{"$f":"IF('P1'!B99=\"\",\"\",'P1'!B99)","v":""},{"$f":"IF('P2'!B99=\"\",\"\",'P2'!B99)","v":""},{"$f":"IF('P3'!B99=\"\",\"\",'P3'!B99)","v":""},{"$f":"IF('P4'!B99=\"\",\"\",'P4'!B99)","v":""},{"$f":"IF('P5'!B99=\"\",\"\",'P5'!B99)","v":""},{"$f":"IF('P6'!B99=\"\",\"\",'P6'!B99)","v":""},{"$f":"IF('P7'!B99=\"\",\"\",'P7'!B99)","v":""},{"$f":"IF('P8'!B99=\"\",\"\",'P8'!B99)","v":""},{"$f":"IF('P9'!B99=\"\",\"\",'P9'!B99)","v":""},{"$f":"IF('P10'!B99=\"\",\"\",'P10'!B99)","v":""},{"$f":"IF('P11'!B99=\"\",\"\",'P11'!B99)","v":""},{"$f":"IF('P12'!B99=\"\",\"\",'P12'!B99)","v":""}]
[null,{"$f":"IF('P1'!B100=\"\",\"\",'P1'!B100)","v":""},{"$f":"IF('P2'!B100=\"\",\"\",'P2'!B100)","v":""},{"$f":"IF('P3'!B100=\"\",\"\",'P3'!B100)","v":""},{"$f":"IF('P4'!B100=\"\",\"\",'P4'!B100)","v":""},{"$f":"IF('P5'!B100=\"\",\"\",'P5'!B100)","v":""},{"$f":"IF('P6'!B100=\"\",\"\",'P6'!B100)","v":""},{"$f":"IF('P7'!B100=\"\",\"\",'P7'!B100)","v":""},{"$f":"IF('P8'!B100=\"\",\"\",'P8'!B100)","v":""},{"$f":"IF('P9'!B100=\"\",\"\",'P9'!B100)","v":""},{"$f":"IF('P10'!B100=\"\",\"\",'P10'!B100)","v":""},{"$f":"IF('P11'!B100=\"\",\"\",'P11'!B100)","v":""},{"$f":"IF('P12'!B100=\"\",\"\",'P12'!B100)","v":""}]
[null,{"$f":"IF('P1'!B101=\"\",\"\",'P1'!B101)","v":""},{"$f":"IF('P2'!B101=\"\",\"\",'P2'!B101)","v":""},{"$f":"IF('P3'!B101=\"\",\"\",'P3'!B101)","v":""},{"$f":"IF('P4'!B101=\"\",\"\",'P4'!B101)","v":""},{"$f":"IF('P5'!B101=\"\",\"\",'P5'!B101)","v":""},{"$f":"IF('P6'!B101=\"\",\"\",'P6'!B101)","v":""},{"$f":"IF('P7'!B101=\"\",\"\",'P7'!B101)","v":""},{"$f":"IF('P8'!B101=\"\",\"\",'P8'!B101)","v":""},{"$f":"IF('P9'!B101=\"\",\"\",'P9'!B101)","v":""},{"$f":"IF('P10'!B101=\"\",\"\",'P10'!B101)","v":""},{"$f":"IF('P11'!B101=\"\",\"\",'P11'!B101)","v":""},{"$f":"IF('P12'!B101=\"\",\"\",'P12'!B101)","v":""}]
["Fin",{"$f":"IF('P1'!B102=\"\",\"\",'P1'!B102)","v":""},{"$f":"IF('P2'!B102=\"\",\"\",'P2'!B102)","v":""},{"$f":"IF('P3'!B102=\"\",\"\",'P3'!B102)","v":""},{"$f":"IF('P4'!B102=\"\",\"\",'P4'!B102)","v":""},{"$f":"IF('P5'!B102=\"\",\"\",'P5'!B102)","v":""},{"$f":"IF('P6'!B102=\"\",\"\",'P6'!B102)","v":""},{"$f":"IF('P7'!B102=\"\",\"\",'P7'!B102)","v":""},{"$f":"IF('P8'!B102=\"\",\"\",'P8'!B102)","v":""},{"$f":"IF('P9'!B102=\"\",\"\",'P9'!B102)","v":""},{"$f":"IF('P10'!B102=\"\",\"\",'P10'!B102)","v":""},{"$f":"IF('P11'!B102=\"\",\"\",'P11'!B102)","v":""},{"$f":"IF('P12'!B102=\"\",\"\",'P12'!B102)","v":""}]
[null,{"$f":"IF('P1'!B103=\"\",\"\",'P1'!B103)","v":""},{"$f":"IF('P2'!B103=\"\",\"\",'P2'!B103)","v":""},{"$f":"IF('P3'!B103=\"\",\"\",'P3'!B103)","v":""},{"$f":"IF('P4'!B103=\"\",\"\",'P4'!B103)","v":""},{"$f":"IF('P5'!B103=\"\",\"\",'P5'!B103)","v":""},{"$f":"IF('P6'!B103=\"\",\"\",'P6'!B103)","v":""},{"$f":"IF('P7'!B103=\"\",\"\",'P7'!B103)","v":""},{"$f":"IF('P8'!B103=\"\",\"\",'P8'!B103)","v":""},{"$f":"IF('P9'!B103=\"\",\"\",'P9'!B103)","v":""},{"$f":"IF('P10'!B103=\"\",\"\",'P10'!B103)","v":""},{"$f":"IF('P11'!B103=\"\",\"\",'P11'!B103)","v":""},{"$f":"IF('P12'!B103=\"\",\"\",'P12'!B103)","v":""}]

{"sheet":"P1","index":2,"n_rows":103,"n_cols":2,"rows_kept":103,"cut":false,"hidden":false,"merged":[[0,0,0,3]]}
["Instructions :\n - Informe ton nom. Il sera repris pour la vue globale ;\n - Pour chacune des activités (compétence) ci-dessous, choisis dans quel quadrant CPT tu la placerais ;\n - Les lignes des titres des blocs d'activités sont optionnelles."]
["Nom de la personne :","Anne"]
["Activités","Quadrant CPT"]
[{"$f":"IF('Vue globale'!A3=\"\",\"\",'Vue globale'!A3)","v":"1. Conception et modélisation d’opportunités entrepreneuriales"}]
[{"$f":"IF('Vue globale'!A4=\"\",\"\",'Vue globale'!A4)","v":"Connaissance de l’environnement "},"Confort"]
[{"$f":"IF('Vue globale'!A5=\"\",\"\",'Vue globale'!A5)","v":"Recherche d’opportunités "},"Confort"]
[{"$f":"IF('Vue globale'!A6=\"\",\"\",'Vue globale'!A6)","v":"Mission et vision "},"Confort"]
[{"$f":"IF('Vue globale'!A7=\"\",\"\",'Vue globale'!A7)","v":"Business model "},"Confort"]
[{"$f":"IF('Vue globale'!A8=\"\",\"\",'Vue globale'!A8)","v":"Evaluation commerciale "},"Inconfort"]
[{"$f":"IF('Vue globale'!A9=\"\",\"\",'Vue globale'!A9)","v":"Evaluation de mise en œuvre "},"Inconfort"]
[{"$f":"IF('Vue globale'!A10=\"\",\"\",'Vue globale'!A10)","v":"Evaluation financière "},"Résignation"]
[{"$f":"IF('Vue globale'!A11=\"\",\"\",'Vue globale'!A11)","v":"2. Gestion de l’information"}]
[{"$f":"IF('Vue globale'!A12=\"\",\"\",'Vue globale'!A12)","v":"Définition des besoins "},"Attraction"]
[{"$f":"IF('Vue globale'!A13=\"\",\"\",'Vue globale'!A13)","v":"Identification de sources "},"Attraction"]
[{"$f":"IF('Vue globale'!A14=\"\",\"\",'Vue globale'!A14)","v":"Veille informationnelle"},"Attraction"]
[{"$f":"IF('Vue globale'!A15=\"\",\"\",'Vue globale'!A15)","v":"Réseautage "},"Inconfort"]
[{"$f":"IF('Vue globale'!A16=\"\",\"\",'Vue globale'!A16)","v":"Informatique et internet "},"Attraction"]
[{"$f":"IF('Vue globale'!A17=\"\",\"\",'Vue globale'!A17)","v":"Analyse et synthèse"},"Attraction"]
[{"$f":"IF('Vue globale'!A18=\"\",\"\",'Vue globale'!A18)","v":"Gestion de la connaissance "},"Attraction"]
[{"$f":"IF('Vue globale'!A19=\"\",\"\",'Vue globale'!A19)","v":"3. Marketing"}]
[{"$f":"IF('Vue globale'!A20=\"\",\"\",'Vue globale'!A20)","v":"Analyse d’opportunités "},"Confort"]
[{"$f":"IF('Vue globale'!A21=\"\",\"\",'Vue globale'!A21)","v":"Etude de marché "},"Inconfort"]
[{"$f":"IF('Vue globale'!A22=\"\",\"\",'Vue globale'!A22)","v":"Sélection de marché "},"Attraction"]
[{"$f":"IF('Vue globale'!A23=\"\",\"\",'Vue globale'!A23)","v":"Conception de prestations "},"Confort"]
[{"$f":"IF('Vue globale'!A24=\"\",\"\",'Vue globale'!A24)","v":"Analyse de concurrence "},"Inconfort"]
[{"$f":"IF('Vue globale'!A25=\"\",\"\",'Vue globale'!A25)","v":"Positionnement "},"Inconfort"]
[{"$f":"IF('Vue globale'!A26=\"\",\"\",'Vue globale'!A26)","v":"Stratégie marketing"},"Attraction"]
[{"$f":"IF('Vue globale'!A27=\"\",\"\",'Vue globale'!A27)","v":"4. Promotion et ventes"}]
[{"$f":"IF('Vue globale'!A28=\"\",\"\",'Vue globale'!A28)","v":"Stratégie commerciale "}]
[{"$f":"IF('Vue globale'!A29=\"\",\"\",'Vue globale'!A29)","v":"Formulation de l’offre "}]
[{"$f":"IF('Vue globale'!A30=\"\",\"\",'Vue globale'!A30)","v":"Choix des canaux "}]
[{"$f":"IF('Vue globale'!A31=\"\",\"\",'Vue globale'!A31)","v":"Promotion des ventes "}]
[{"$f":"IF('Vue globale'!A32=\"\",\"\",'Vue globale'!A32)","v":"Prospection et acquisition "}]
[{"$f":"IF('Vue globale'!A33=\"\",\"\",'Vue globale'!A33)","v":"Suivi commercial "}]
[{"$f":"IF('Vue globale'!A34=\"\",\"\",'Vue globale'!A34)","v":"Fidélisation "}]
[{"$f":"IF('Vue globale'!A35=\"\",\"\",'Vue globale'!A35)","v":"5. Relations et communication institutionnelles"}]
[{"$f":"IF('Vue globale'!A36=\"\",\"\",'Vue globale'!A36)","v":"Sphère d’influence "}]
[{"$f":"IF('Vue globale'!A37=\"\",\"\",'Vue globale'!A37)","v":"Communication institutionnelle "}]
[{"$f":"IF('Vue globale'!A38=\"\",\"\",'Vue globale'!A38)","v":"Communication dans les médias "}]
[{"$f":"IF('Vue globale'!A39=\"\",\"\",'Vue globale'!A39)","v":"Réseaux sociaux "}]
[{"$f":"IF('Vue globale'!A40=\"\",\"\",'Vue globale'!A40)","v":"Gouvernance externe "}]
[{"$f":"IF('Vue globale'!A41=\"\",\"\",'Vue globale'!A41)","v":"Alliances et partenariats "}]
[{"$f":"IF('Vue globale'!A42=\"\",\"\",'Vue globale'!A42)","v":"6. Stratégie et gestion de projets"}]
[{"$f":"IF('Vue globale'!A43=\"\",\"\",'Vue globale'!A43)","v":"Vision stratégique "}]
[{"$f":"IF('Vue globale'!A44=\"\",\"\",'Vue globale'!A44)","v":"Gestion des risques "}]
[{"$f":"IF('Vue globale'!A45=\"\",\"\",'Vue globale'!A45)","v":"Stratégie de développement "}]
[{"$f":"IF('Vue globale'!A46=\"\",\"\",'Vue globale'!A46)","v":"Fixation d’objectifs "}]
[{"$f":"IF('Vue globale'!A47=\"\",\"\",'Vue globale'!A47)","v":"Mesure de résultats "}]
[{"$f":"IF('Vue globale'!A48=\"\",\"\",'Vue globale'!A48)","v":"Gestion de projets "}]
[{"$f":"IF('Vue globale'!A49=\"\",\"\",'Vue globale'!A49)","v":"Evaluation "}]
[{"$f":"IF('Vue globale'!A50=\"\",\"\",'Vue globale'!A50)","v":"7. organisation, production et logistique"}]
[{"$f":"IF('Vue globale'!A51=\"\",\"\",'Vue globale'!A51)","v":"Administration"}]
[{"$f":"IF('Vue globale'!A52=\"\",\"\",'Vue globale'!A52)","v":"Qualité"}]
[{"$f":"IF('Vue globale'!A53=\"\",\"\",'Vue globale'!A53)","v":"Ressources"}]
[{"$f":"IF('Vue globale'!A54=\"\",\"\",'Vue globale'!A54)","v":"Infrastructure"}]
[{"$f":"IF('Vue globale'!A55=\"\",\"\",'Vue globale'!A55)","v":"Négociation"}]
[{"$f":"IF('Vue globale'!A56=\"\",\"\",'Vue globale'!A56)","v":"Production"}]
[{"$f":"IF('Vue globale'!A57=\"\",\"\",'Vue globale'!A57)","v":"Distribution"}]
[{"$f":"IF('Vue globale'!A58=\"\",\"\",'Vue globale'!A58)","v":"Juridique"}]
[{"$f":"IF('Vue globale'!A59=\"\",\"\",'Vue globale'!A59)","v":"8. Gestion financière et des coûts"}]
[{"$f":"IF('Vue globale'!A60=\"\",\"\",'Vue globale'!A60)","v":"Point mort "}]
[{"$f":"IF('Vue globale'!A61=\"\",\"\",'Vue globale'!A61)","v":"Planification financière "}]
[{"$f":"IF('Vue globale'!A62=\"\",\"\",'Vue globale'!A62)","v":"Budget "}]
[{"$f":"IF('Vue globale'!A63=\"\",\"\",'Vue globale'!A63)","v":"Créanciers et débiteurs "}]
[{"$f":"IF('Vue globale'!A64=\"\",\"\",'Vue globale'!A64)","v":"Trésorerie "}]
[{"$f":"IF('Vue globale'!A65=\"\",\"\",'Vue globale'!A65)","v":"Prise de décision "}]
[{"$f":"IF('Vue globale'!A66=\"\",\"\",'Vue globale'!A66)","v":"Relations financières "}]
[{"$f":"IF('Vue globale'!A67=\"\",\"\",'Vue globale'!A67)","v":"Recherche de fonds et investisseurs"}]
[{"$f":"IF('Vue globale'!A68=\"\",\"\",'Vue globale'!A68)","v":"9. Gestion des RH et gouvernance interne"}]
[{"$f":"IF('Vue globale'!A69=\"\",\"\",'Vue globale'!A69)","v":"Politique RH"}]
[{"$f":"IF('Vue globale'!A70=\"\",\"\",'Vue globale'!A70)","v":"Gestion RH"}]
[{"$f":"IF('Vue globale'!A71=\"\",\"\",'Vue globale'!A71)","v":"Cahiers des charges"}]
[{"$f":"IF('Vue globale'!A72=\"\",\"\",'Vue globale'!A72)","v":"Management"}]
[{"$f":"IF('Vue globale'!A73=\"\",\"\",'Vue globale'!A73)","v":"Leadership"}]
[{"$f":"IF('Vue globale'!A74=\"\",\"\",'Vue globale'!A74)","v":"Participation"}]
[{"$f":"IF('Vue globale'!A75=\"\",\"\",'Vue globale'!A75)","v":"Gestion de conflits"}]
[{"$f":"IF('Vue globale'!A76=\"\",\"\",'Vue globale'!A76)","v":""}]
[{"$f":"IF('Vue globale'!A77=\"\",\"\",'Vue globale'!A77)","v":""}]
[{"$f":"IF('Vue globale'!A78=\"\",\"\",'Vue globale'!A78)","v":""}]
[{"$f":"IF('Vue globale'!A79=\"\",\"\",'Vue globale'!A79)","v":""}]
[{"$f":"IF('Vue globale'!A80=\"\",\"\",'Vue globale'!A80)","v":""}]
[{"$f":"IF('Vue globale'!A81=\"\",\"\",'Vue globale'!A81)","v":""}]
[{"$f":"IF('Vue globale'!A82=\"\",\"\",'Vue globale'!A82)","v":""}]
[{"$f":"IF('Vue globale'!A83=\"\",\"\",'Vue globale'!A83)","v":""}]
[{"$f":"IF('Vue globale'!A84=\"\",\"\",'Vue globale'!A84)","v":""}]
[{"$f":"IF('Vue globale'!A85=\"\",\"\",'Vue globale'!A85)","v":""}]
[{"$f":"IF('Vue globale'!A86=\"\",\"\",'Vue globale'!A86)","v":""}]
[{"$f":"IF('Vue globale'!A87=\"\",\"\",'Vue globale'!A87)","v":""}]
[{"$f":"IF('Vue globale'!A88=\"\",\"\",'Vue globale'!A88)","v":""}]
[{"$f":"IF('Vue globale'!A89=\"\",\"\",'Vue globale'!A89)","v":""}]
[{"$f":"IF('Vue globale'!A90=\"\",\"\",'Vue globale'!A90)","v":""}]
[{"$f":"IF('Vue globale'!A91=\"\",\"\",'Vue globale'!A91)","v":""}]
[{"$f":"IF('Vue globale'!A92=\"\",\"\",'Vue globale'!A92)","v":""}]
[{"$f":"IF('Vue globale'!A93=\"\",\"\",'Vue globale'!A93)","v":""}]
[{"$f":"IF('Vue globale'!A94=\"\",\"\",'Vue globale'!A94)","v":""}]
[{"$f":"IF('Vue globale'!A95=\"\",\"\",'Vue globale'!A95)","v":""}]
[{"$f":"IF('Vue globale'!A96=\"\",\"\",'Vue globale'!A96)","v":""}]
[{"$f":"IF('Vue globale'!A97=\"\",\"\",'Vue globale'!A97)","v":""}]
[{"$f":"IF('Vue globale'!A98=\"\",\"\",'Vue globale'!A98)","v":""}]
[{"$f":"IF('Vue globale'!A99=\"\",\"\",'Vue globale'!A99)","v":""}]
[{"$f":"IF('Vue globale'!A100=\"\",\"\",'Vue globale'!A100)","v":""}]
[{"$f":"IF('Vue globale'!A101=\"\",\"\",'Vue globale'!A101)","v":"Fin"}]
[{"$f":"IF('Vue globale'!A102=\"\",\"\",'Vue globale'!A102)","v":""}]

{"sheet":"P2","index":3,"n_rows":103,"n_cols":2,"rows_kept":103,"cut":false,"hidden":false,"merged":[[0,0,0,3]]}
["Instructions :\n - Informe ton nom. Il sera repris pour la vue globale ;\n - Pour chacune des activités (compétence) ci-dessous, choisis dans quel quadrant CPT tu la placerais ;\n - Les lignes des titres des blocs d'activités sont optionnelles."]
["Nom de la personne :","Jean"]
["Activités","Quadrant CPT"]
[{"$f":"IF('Vue globale'!A3=\"\",\"\",'Vue globale'!A3)","v":"1. Conception et modélisation d’opportunités entrepreneuriales"}]
[{"$f":"IF('Vue globale'!A4=\"\",\"\",'Vue globale'!A4)","v":"Connaissance de l’environnement "},"Résignation"]
[{"$f":"IF('Vue globale'!A5=\"\",\"\",'Vue globale'!A5)","v":"Recherche d’opportunités "},"Résignation"]
[{"$f":"IF('Vue globale'!A6=\"\",\"\",'Vue globale'!A6)","v":"Mission et vision "},"Résignation"]
[{"$f":"IF('Vue globale'!A7=\"\",\"\",'Vue globale'!A7)","v":"Business model "},"Inconfort"]
[{"$f":"IF('Vue globale'!A8=\"\",\"\",'Vue globale'!A8)","v":"Evaluation commerciale "},"Résignation"]
[{"$f":"IF('Vue globale'!A9=\"\",\"\",'Vue globale'!A9)","v":"Evaluation de mise en œuvre "},"Attraction"]
[{"$f":"IF('Vue globale'!A10=\"\",\"\",'Vue globale'!A10)","v":"Evaluation financière "},"Résignation"]
[{"$f":"IF('Vue globale'!A11=\"\",\"\",'Vue globale'!A11)","v":"2. Gestion de l’information"}]
[{"$f":"IF('Vue globale'!A12=\"\",\"\",'Vue globale'!A12)","v":"Définition des besoins "},"Confort"]
[{"$f":"IF('Vue globale'!A13=\"\",\"\",'Vue globale'!A13)","v":"Identification de sources "},"Inconfort"]
[{"$f":"IF('Vue globale'!A14=\"\",\"\",'Vue globale'!A14)","v":"Veille informationnelle"},"Confort"]
[{"$f":"IF('Vue globale'!A15=\"\",\"\",'Vue globale'!A15)","v":"Réseautage "},"Confort"]
[{"$f":"IF('Vue globale'!A16=\"\",\"\",'Vue globale'!A16)","v":"Informatique et internet "},"Inconfort"]
[{"$f":"IF('Vue globale'!A17=\"\",\"\",'Vue globale'!A17)","v":"Analyse et synthèse"},"Inconfort"]
[{"$f":"IF('Vue globale'!A18=\"\",\"\",'Vue globale'!A18)","v":"Gestion de la connaissance "},"Attraction"]
[{"$f":"IF('Vue globale'!A19=\"\",\"\",'Vue globale'!A19)","v":"3. Marketing"}]
[{"$f":"IF('Vue globale'!A20=\"\",\"\",'Vue globale'!A20)","v":"Analyse d’opportunités "},"Confort"]
[{"$f":"IF('Vue globale'!A21=\"\",\"\",'Vue globale'!A21)","v":"Etude de marché "},"Confort"]
[{"$f":"IF('Vue globale'!A22=\"\",\"\",'Vue globale'!A22)","v":"Sélection de marché "},"Confort"]
[{"$f":"IF('Vue globale'!A23=\"\",\"\",'Vue globale'!A23)","v":"Conception de prestations "},"Confort"]
[{"$f":"IF('Vue globale'!A24=\"\",\"\",'Vue globale'!A24)","v":"Analyse de concurrence "},"Confort"]
[{"$f":"IF('Vue globale'!A25=\"\",\"\",'Vue globale'!A25)","v":"Positionnement "},"Inconfort"]
[{"$f":"IF('Vue globale'!A26=\"\",\"\",'Vue globale'!A26)","v":"Stratégie marketing"},"Inconfort"]
[{"$f":"IF('Vue globale'!A27=\"\",\"\",'Vue globale'!A27)","v":"4. Promotion et ventes"}]
[{"$f":"IF('Vue globale'!A28=\"\",\"\",'Vue globale'!A28)","v":"Stratégie commerciale "}]
[{"$f":"IF('Vue globale'!A29=\"\",\"\",'Vue globale'!A29)","v":"Formulation de l’offre "}]
[{"$f":"IF('Vue globale'!A30=\"\",\"\",'Vue globale'!A30)","v":"Choix des canaux "}]
[{"$f":"IF('Vue globale'!A31=\"\",\"\",'Vue globale'!A31)","v":"Promotion des ventes "}]
[{"$f":"IF('Vue globale'!A32=\"\",\"\",'Vue globale'!A32)","v":"Prospection et acquisition "}]
[{"$f":"IF('Vue globale'!A33=\"\",\"\",'Vue globale'!A33)","v":"Suivi commercial "}]
[{"$f":"IF('Vue globale'!A34=\"\",\"\",'Vue globale'!A34)","v":"Fidélisation "}]
[{"$f":"IF('Vue globale'!A35=\"\",\"\",'Vue globale'!A35)","v":"5. Relations et communication institutionnelles"}]
[{"$f":"IF('Vue globale'!A36=\"\",\"\",'Vue globale'!A36)","v":"Sphère d’influence "}]
[{"$f":"IF('Vue globale'!A37=\"\",\"\",'Vue globale'!A37)","v":"Communication institutionnelle "}]
[{"$f":"IF('Vue globale'!A38=\"\",\"\",'Vue globale'!A38)","v":"Communication dans les médias "}]
[{"$f":"IF('Vue globale'!A39=\"\",\"\",'Vue globale'!A39)","v":"Réseaux sociaux "}]
[{"$f":"IF('Vue globale'!A40=\"\",\"\",'Vue globale'!A40)","v":"Gouvernance externe "}]
[{"$f":"IF('Vue globale'!A41=\"\",\"\",'Vue globale'!A41)","v":"Alliances et partenariats "}]
[{"$f":"IF('Vue globale'!A42=\"\",\"\",'Vue globale'!A42)","v":"6. Stratégie et gestion de projets"}]
[{"$f":"IF('Vue globale'!A43=\"\",\"\",'Vue globale'!A43)","v":"Vision stratégique "}]
[{"$f":"IF('Vue globale'!A44=\"\",\"\",'Vue globale'!A44)","v":"Gestion des risques "}]
[{"$f":"IF('Vue globale'!A45=\"\",\"\",'Vue globale'!A45)","v":"Stratégie de développement "}]
[{"$f":"IF('Vue globale'!A46=\"\",\"\",'Vue globale'!A46)","v":"Fixation d’objectifs "}]
[{"$f":"IF('Vue globale'!A47=\"\",\"\",'Vue globale'!A47)","v":"Mesure de résultats "}]
[{"$f":"IF('Vue globale'!A48=\"\",\"\",'Vue globale'!A48)","v":"Gestion de projets "}]
[{"$f":"IF('Vue globale'!A49=\"\",\"\",'Vue globale'!A49)","v":"Evaluation "}]
[{"$f":"IF('Vue globale'!A50=\"\",\"\",'Vue globale'!A50)","v":"7. organisation, production et logistique"}]
[{"$f":"IF('Vue globale'!A51=\"\",\"\",'Vue globale'!A51)","v":"Administration"}]
[{"$f":"IF('Vue globale'!A52=\"\",\"\",'Vue globale'!A52)","v":"Qualité"}]
[{"$f":"IF('Vue globale'!A53=\"\",\"\",'Vue globale'!A53)","v":"Ressources"}]
[{"$f":"IF('Vue globale'!A54=\"\",\"\",'Vue globale'!A54)","v":"Infrastructure"}]
[{"$f":"IF('Vue globale'!A55=\"\",\"\",'Vue globale'!A55)","v":"Négociation"}]
[{"$f":"IF('Vue globale'!A56=\"\",\"\",'Vue globale'!A56)","v":"Production"}]
[{"$f":"IF('Vue globale'!A57=\"\",\"\",'Vue globale'!A57)","v":"Distribution"}]
[{"$f":"IF('Vue globale'!A58=\"\",\"\",'Vue globale'!A58)","v":"Juridique"}]
[{"$f":"IF('Vue globale'!A59=\"\",\"\",'Vue globale'!A59)","v":"8. Gestion financière et des coûts"}]
[{"$f":"IF('Vue globale'!A60=\"\",\"\",'Vue globale'!A60)","v":"Point mort "}]
[{"$f":"IF('Vue globale'!A61=\"\",\"\",'Vue globale'!A61)","v":"Planification financière "}]
[{"$f":"IF('Vue globale'!A62=\"\",\"\",'Vue globale'!A62)","v":"Budget "}]
[{"$f":"IF('Vue globale'!A63=\"\",\"\",'Vue globale'!A63)","v":"Créanciers et débiteurs "}]
[{"$f":"IF('Vue globale'!A64=\"\",\"\",'Vue globale'!A64)","v":"Trésorerie "}]
[{"$f":"IF('Vue globale'!A65=\"\",\"\",'Vue globale'!A65)","v":"Prise de décision "}]
[{"$f":"IF('Vue globale'!A66=\"\",\"\",'Vue globale'!A66)","v":"Relations financières "}]
[{"$f":"IF('Vue globale'!A67=\"\",\"\",'Vue globale'!A67)","v":"Recherche de fonds et investisseurs"}]
[{"$f":"IF('Vue globale'!A68=\"\",\"\",'Vue globale'!A68)","v":"9. Gestion des RH et gouvernance interne"}]
[{"$f":"IF('Vue globale'!A69=\"\",\"\",'Vue globale'!A69)","v":"Politique RH"}]
[{"$f":"IF('Vue globale'!A70=\"\",\"\",'Vue globale'!A70)","v":"Gestion RH"}]
[{"$f":"IF('Vue globale'!A71=\"\",\"\",'Vue globale'!A71)","v":"Cahiers des charges"}]
[{"$f":"IF('Vue globale'!A72=\"\",\"\",'Vue globale'!A72)","v":"Management"}]
[{"$f":"IF('Vue globale'!A73=\"\",\"\",'Vue globale'!A73)","v":"Leadership"}]
[{"$f":"IF('Vue globale'!A74=\"\",\"\",'Vue globale'!A74)","v":"Participation"}]
[{"$f":"IF('Vue globale'!A75=\"\",\"\",'Vue globale'!A75)","v":"Gestion de conflits"}]
[{"$f":"IF('Vue globale'!A76=\"\",\"\",'Vue globale'!A76)","v":""}]
[{"$f":"IF('Vue globale'!A77=\"\",\"\",'Vue globale'!A77)","v":""}]
[{"$f":"IF('Vue globale'!A78=\"\",\"\",'Vue globale'!A78)","v":""}]
[{"$f":"IF('Vue globale'!A79=\"\",\"\",'Vue globale'!A79)","v":""}]
[{"$f":"IF('Vue globale'!A80=\"\",\"\",'Vue globale'!A80)","v":""}]
[{"$f":"IF('Vue globale'!A81=\"\",\"\",'Vue globale'!A81)","v":""}]
[{"$f":"IF('Vue globale'!A82=\"\",\"\",'Vue globale'!A82)","v":""}]
[{"$f":"IF('Vue globale'!A83=\"\",\"\",'Vue globale'!A83)","v":""}]
[{"$f":"IF('Vue globale'!A84=\"\",\"\",'Vue globale'!A84)","v":""}]
[{"$f":"IF('Vue globale'!A85=\"\",\"\",'Vue globale'!A85)","v":""}]
[{"$f":"IF('Vue globale'!A86=\"\",\"\",'Vue globale'!A86)","v":""}]
[{"$f":"IF('Vue globale'!A87=\"\",\"\",'Vue globale'!A87)","v":""}]
[{"$f":"IF('Vue globale'!A88=\"\",\"\",'Vue globale'!A88)","v":""}]
[{"$f":"IF('Vue globale'!A89=\"\",\"\",'Vue globale'!A89)","v":""}]
[{"$f":"IF('Vue globale'!A90=\"\",\"\",'Vue globale'!A90)","v":""}]
[{"$f":"IF('Vue globale'!A91=\"\",\"\",'Vue globale'!A91)","v":""}]
[{"$f":"IF('Vue globale'!A92=\"\",\"\",'Vue globale'!A92)","v":""}]
[{"$f":"IF('Vue globale'!A93=\"\",\"\",'Vue globale'!A93)","v":""}]
[{"$f":"IF('Vue globale'!A94=\"\",\"\",'Vue globale'!A94)","v":""}]
[{"$f":"IF('Vue globale'!A95=\"\",\"\",'Vue globale'!A95)","v":""}]
[{"$f":"IF('Vue globale'!A96=\"\",\"\",'Vue globale'!A96)","v":""}]
[{"$f":"IF('Vue globale'!A97=\"\",\"\",'Vue globale'!A97)","v":""}]
[{"$f":"IF('Vue globale'!A98=\"\",\"\",'Vue globale'!A98)","v":""}]
[{"$f":"IF('Vue globale'!A99=\"\",\"\",'Vue globale'!A99)","v":""}]
[{"$f":"IF('Vue globale'!A100=\"\",\"\",'Vue globale'!A100)","v":""}]
[{"$f":"IF('Vue globale'!A101=\"\",\"\",'Vue globale'!A101)","v":"Fin"}]
[{"$f":"IF('Vue globale'!A102=\"\",\"\",'Vue globale'!A102)","v":""}]

{"sheet":"P3","index":4,"n_rows":103,"n_cols":2,"rows_kept":103,"cut":false,"hidden":false,"merged":[[0,0,0,3]]}
["Instructions :\n - Informe ton nom. Il sera repris pour la vue globale ;\n - Pour chacune des activités (compétence) ci-dessous, choisis dans quel quadrant CPT tu la placerais ;\n - Les lignes des titres des blocs d'activités sont optionnelles."]
["Nom de la personne :","Dominique"]
["Activités","Quadrant CPT"]
[{"$f":"IF('Vue globale'!A3=\"\",\"\",'Vue globale'!A3)","v":"1. Conception et modélisation d’opportunités entrepreneuriales"}]
[{"$f":"IF('Vue globale'!A4=\"\",\"\",'Vue globale'!A4)","v":"Connaissance de l’environnement "},"Inconfort"]
[{"$f":"IF('Vue globale'!A5=\"\",\"\",'Vue globale'!A5)","v":"Recherche d’opportunités "},"Attraction"]
[{"$f":"IF('Vue globale'!A6=\"\",\"\",'Vue globale'!A6)","v":"Mission et vision "},"Attraction"]
[{"$f":"IF('Vue globale'!A7=\"\",\"\",'Vue globale'!A7)","v":"Business model "},"Attraction"]
[{"$f":"IF('Vue globale'!A8=\"\",\"\",'Vue globale'!A8)","v":"Evaluation commerciale "},"Attraction"]
[{"$f":"IF('Vue globale'!A9=\"\",\"\",'Vue globale'!A9)","v":"Evaluation de mise en œuvre "},"Résignation"]
[{"$f":"IF('Vue globale'!A10=\"\",\"\",'Vue globale'!A10)","v":"Evaluation financière "},"Résignation"]
[{"$f":"IF('Vue globale'!A11=\"\",\"\",'Vue globale'!A11)","v":"2. Gestion de l’information"}]
[{"$f":"IF('Vue globale'!A12=\"\",\"\",'Vue globale'!A12)","v":"Définition des besoins "},"Inconfort"]
[{"$f":"IF('Vue globale'!A13=\"\",\"\",'Vue globale'!A13)","v":"Identification de sources "},"Inconfort"]
[{"$f":"IF('Vue globale'!A14=\"\",\"\",'Vue globale'!A14)","v":"Veille informationnelle"},"Confort"]
[{"$f":"IF('Vue globale'!A15=\"\",\"\",'Vue globale'!A15)","v":"Réseautage "},"Inconfort"]
[{"$f":"IF('Vue globale'!A16=\"\",\"\",'Vue globale'!A16)","v":"Informatique et internet "},"Confort"]
[{"$f":"IF('Vue globale'!A17=\"\",\"\",'Vue globale'!A17)","v":"Analyse et synthèse"},"Confort"]
[{"$f":"IF('Vue globale'!A18=\"\",\"\",'Vue globale'!A18)","v":"Gestion de la connaissance "},"Confort"]
[{"$f":"IF('Vue globale'!A19=\"\",\"\",'Vue globale'!A19)","v":"3. Marketing"}]
[{"$f":"IF('Vue globale'!A20=\"\",\"\",'Vue globale'!A20)","v":"Analyse d’opportunités "},"Inconfort"]
[{"$f":"IF('Vue globale'!A21=\"\",\"\",'Vue globale'!A21)","v":"Etude de marché "},"Confort"]
[{"$f":"IF('Vue globale'!A22=\"\",\"\",'Vue globale'!A22)","v":"Sélection de marché "},"Inconfort"]
[{"$f":"IF('Vue globale'!A23=\"\",\"\",'Vue globale'!A23)","v":"Conception de prestations "},"Attraction"]
[{"$f":"IF('Vue globale'!A24=\"\",\"\",'Vue globale'!A24)","v":"Analyse de concurrence "},"Inconfort"]
[{"$f":"IF('Vue globale'!A25=\"\",\"\",'Vue globale'!A25)","v":"Positionnement "},"Résignation"]
[{"$f":"IF('Vue globale'!A26=\"\",\"\",'Vue globale'!A26)","v":"Stratégie marketing"},"Résignation"]
[{"$f":"IF('Vue globale'!A27=\"\",\"\",'Vue globale'!A27)","v":"4. Promotion et ventes"}]
[{"$f":"IF('Vue globale'!A28=\"\",\"\",'Vue globale'!A28)","v":"Stratégie commerciale "}]
[{"$f":"IF('Vue globale'!A29=\"\",\"\",'Vue globale'!A29)","v":"Formulation de l’offre "}]
[{"$f":"IF('Vue globale'!A30=\"\",\"\",'Vue globale'!A30)","v":"Choix des canaux "}]
[{"$f":"IF('Vue globale'!A31=\"\",\"\",'Vue globale'!A31)","v":"Promotion des ventes "}]
[{"$f":"IF('Vue globale'!A32=\"\",\"\",'Vue globale'!A32)","v":"Prospection et acquisition "}]
[{"$f":"IF('Vue globale'!A33=\"\",\"\",'Vue globale'!A33)","v":"Suivi commercial "}]
[{"$f":"IF('Vue globale'!A34=\"\",\"\",'Vue globale'!A34)","v":"Fidélisation "}]
[{"$f":"IF('Vue globale'!A35=\"\",\"\",'Vue globale'!A35)","v":"5. Relations et communication institutionnelles"}]
[{"$f":"IF('Vue globale'!A36=\"\",\"\",'Vue globale'!A36)","v":"Sphère d’influence "}]
[{"$f":"IF('Vue globale'!A37=\"\",\"\",'Vue globale'!A37)","v":"Communication institutionnelle "}]
[{"$f":"IF('Vue globale'!A38=\"\",\"\",'Vue globale'!A38)","v":"Communication dans les médias "}]
[{"$f":"IF('Vue globale'!A39=\"\",\"\",'Vue globale'!A39)","v":"Réseaux sociaux "}]
[{"$f":"IF('Vue globale'!A40=\"\",\"\",'Vue globale'!A40)","v":"Gouvernance externe "}]
[{"$f":"IF('Vue globale'!A41=\"\",\"\",'Vue globale'!A41)","v":"Alliances et partenariats "}]
[{"$f":"IF('Vue globale'!A42=\"\",\"\",'Vue globale'!A42)","v":"6. Stratégie et gestion de projets"}]
[{"$f":"IF('Vue globale'!A43=\"\",\"\",'Vue globale'!A43)","v":"Vision stratégique "}]
[{"$f":"IF('Vue globale'!A44=\"\",\"\",'Vue globale'!A44)","v":"Gestion des risques "}]
[{"$f":"IF('Vue globale'!A45=\"\",\"\",'Vue globale'!A45)","v":"Stratégie de développement "}]
[{"$f":"IF('Vue globale'!A46=\"\",\"\",'Vue globale'!A46)","v":"Fixation d’objectifs "}]
[{"$f":"IF('Vue globale'!A47=\"\",\"\",'Vue globale'!A47)","v":"Mesure de résultats "}]
[{"$f":"IF('Vue globale'!A48=\"\",\"\",'Vue globale'!A48)","v":"Gestion de projets "}]
[{"$f":"IF('Vue globale'!A49=\"\",\"\",'Vue globale'!A49)","v":"Evaluation "}]
[{"$f":"IF('Vue globale'!A50=\"\",\"\",'Vue globale'!A50)","v":"7. organisation, production et logistique"}]
[{"$f":"IF('Vue globale'!A51=\"\",\"\",'Vue globale'!A51)","v":"Administration"}]
[{"$f":"IF('Vue globale'!A52=\"\",\"\",'Vue globale'!A52)","v":"Qualité"}]
[{"$f":"IF('Vue globale'!A53=\"\",\"\",'Vue globale'!A53)","v":"Ressources"}]
[{"$f":"IF('Vue globale'!A54=\"\",\"\",'Vue globale'!A54)","v":"Infrastructure"}]
[{"$f":"IF('Vue globale'!A55=\"\",\"\",'Vue globale'!A55)","v":"Négociation"}]
[{"$f":"IF('Vue globale'!A56=\"\",\"\",'Vue globale'!A56)","v":"Production"}]
[{"$f":"IF('Vue globale'!A57=\"\",\"\",'Vue globale'!A57)","v":"Distribution"}]
[{"$f":"IF('Vue globale'!A58=\"\",\"\",'Vue globale'!A58)","v":"Juridique"}]
[{"$f":"IF('Vue globale'!A59=\"\",\"\",'Vue globale'!A59)","v":"8. Gestion financière et des coûts"}]
[{"$f":"IF('Vue globale'!A60=\"\",\"\",'Vue globale'!A60)","v":"Point mort "}]
[{"$f":"IF('Vue globale'!A61=\"\",\"\",'Vue globale'!A61)","v":"Planification financière "}]
[{"$f":"IF('Vue globale'!A62=\"\",\"\",'Vue globale'!A62)","v":"Budget "}]
[{"$f":"IF('Vue globale'!A63=\"\",\"\",'Vue globale'!A63)","v":"Créanciers et débiteurs "}]
[{"$f":"IF('Vue globale'!A64=\"\",\"\",'Vue globale'!A64)","v":"Trésorerie "}]
[{"$f":"IF('Vue globale'!A65=\"\",\"\",'Vue globale'!A65)","v":"Prise de décision "}]
[{"$f":"IF('Vue globale'!A66=\"\",\"\",'Vue globale'!A66)","v":"Relations financières "}]
[{"$f":"IF('Vue globale'!A67=\"\",\"\",'Vue globale'!A67)","v":"Recherche de fonds et investisseurs"}]
[{"$f":"IF('Vue globale'!A68=\"\",\"\",'Vue globale'!A68)","v":"9. Gestion des RH et gouvernance interne"}]
[{"$f":"IF('Vue globale'!A69=\"\",\"\",'Vue globale'!A69)","v":"Politique RH"}]
[{"$f":"IF('Vue globale'!A70=\"\",\"\",'Vue globale'!A70)","v":"Gestion RH"}]
[{"$f":"IF('Vue globale'!A71=\"\",\"\",'Vue globale'!A71)","v":"Cahiers des charges"}]
[{"$f":"IF('Vue globale'!A72=\"\",\"\",'Vue globale'!A72)","v":"Management"}]
[{"$f":"IF('Vue globale'!A73=\"\",\"\",'Vue globale'!A73)","v":"Leadership"}]
[{"$f":"IF('Vue globale'!A74=\"\",\"\",'Vue globale'!A74)","v":"Participation"}]
[{"$f":"IF('Vue globale'!A75=\"\",\"\",'Vue globale'!A75)","v":"Gestion de conflits"}]
[{"$f":"IF('Vue globale'!A76=\"\",\"\",'Vue globale'!A76)","v":""}]
[{"$f":"IF('Vue globale'!A77=\"\",\"\",'Vue globale'!A77)","v":""}]
[{"$f":"IF('Vue globale'!A78=\"\",\"\",'Vue globale'!A78)","v":""}]
[{"$f":"IF('Vue globale'!A79=\"\",\"\",'Vue globale'!A79)","v":""}]
[{"$f":"IF('Vue globale'!A80=\"\",\"\",'Vue globale'!A80)","v":""}]
[{"$f":"IF('Vue globale'!A81=\"\",\"\",'Vue globale'!A81)","v":""}]
[{"$f":"IF('Vue globale'!A82=\"\",\"\",'Vue globale'!A82)","v":""}]
[{"$f":"IF('Vue globale'!A83=\"\",\"\",'Vue globale'!A83)","v":""}]
[{"$f":"IF('Vue globale'!A84=\"\",\"\",'Vue globale'!A84)","v":""}]
[{"$f":"IF('Vue globale'!A85=\"\",\"\",'Vue globale'!A85)","v":""}]
[{"$f":"IF('Vue globale'!A86=\"\",\"\",'Vue globale'!A86)","v":""}]
[{"$f":"IF('Vue globale'!A87=\"\",\"\",'Vue globale'!A87)","v":""}]
[{"$f":"IF('Vue globale'!A88=\"\",\"\",'Vue globale'!A88)","v":""}]
[{"$f":"IF('Vue globale'!A89=\"\",\"\",'Vue globale'!A89)","v":""}]
[{"$f":"IF('Vue globale'!A90=\"\",\"\",'Vue globale'!A90)","v":""}]
[{"$f":"IF('Vue globale'!A91=\"\",\"\",'Vue globale'!A91)","v":""}]
[{"$f":"IF('Vue globale'!A92=\"\",\"\",'Vue globale'!A92)","v":""}]
[{"$f":"IF('Vue globale'!A93=\"\",\"\",'Vue globale'!A93)","v":""}]
[{"$f":"IF('Vue globale'!A94=\"\",\"\",'Vue globale'!A94)","v":""}]
[{"$f":"IF('Vue globale'!A95=\"\",\"\",'Vue globale'!A95)","v":""}]
[{"$f":"IF('Vue globale'!A96=\"\",\"\",'Vue globale'!A96)","v":""}]
[{"$f":"IF('Vue globale'!A97=\"\",\"\",'Vue globale'!A97)","v":""}]
[{"$f":"IF('Vue globale'!A98=\"\",\"\",'Vue globale'!A98)","v":""}]
[{"$f":"IF('Vue globale'!A99=\"\",\"\",'Vue globale'!A99)","v":""}]
[{"$f":"IF('Vue globale'!A100=\"\",\"\",'Vue globale'!A100)","v":""}]
[{"$f":"IF('Vue globale'!A101=\"\",\"\",'Vue globale'!A101)","v":"Fin"}]
[{"$f":"IF('Vue globale'!A102=\"\",\"\",'Vue globale'!A102)","v":""}]

{"sheet":"P4","index":5,"n_rows":103,"n_cols":2,"rows_kept":103,"cut":false,"hidden":false,"merged":[[0,0,0,3]]}
["Instructions :\n - Informe ton nom. Il sera repris pour la vue globale ;\n - Pour chacune des activités (compétence) ci-dessous, choisis dans quel quadrant CPT tu la placerais ;\n - Les lignes des titres des blocs d'activités sont optionnelles."]
["Nom de la personne :","P4"]
["Activités","Quadrant CPT"]
[{"$f":"IF('Vue globale'!A3=\"\",\"\",'Vue globale'!A3)","v":"1. Conception et modélisation d’opportunités entrepreneuriales"}]
[{"$f":"IF('Vue globale'!A4=\"\",\"\",'Vue globale'!A4)","v":"Connaissance de l’environnement "}]
[{"$f":"IF('Vue globale'!A5=\"\",\"\",'Vue globale'!A5)","v":"Recherche d’opportunités "}]
[{"$f":"IF('Vue globale'!A6=\"\",\"\",'Vue globale'!A6)","v":"Mission et vision "}]
[{"$f":"IF('Vue globale'!A7=\"\",\"\",'Vue globale'!A7)","v":"Business model "}]
[{"$f":"IF('Vue globale'!A8=\"\",\"\",'Vue globale'!A8)","v":"Evaluation commerciale "}]
[{"$f":"IF('Vue globale'!A9=\"\",\"\",'Vue globale'!A9)","v":"Evaluation de mise en œuvre "}]
[{"$f":"IF('Vue globale'!A10=\"\",\"\",'Vue globale'!A10)","v":"Evaluation financière "}]
[{"$f":"IF('Vue globale'!A11=\"\",\"\",'Vue globale'!A11)","v":"2. Gestion de l’information"}]
[{"$f":"IF('Vue globale'!A12=\"\",\"\",'Vue globale'!A12)","v":"Définition des besoins "}]
[{"$f":"IF('Vue globale'!A13=\"\",\"\",'Vue globale'!A13)","v":"Identification de sources "}]
[{"$f":"IF('Vue globale'!A14=\"\",\"\",'Vue globale'!A14)","v":"Veille informationnelle"}]
[{"$f":"IF('Vue globale'!A15=\"\",\"\",'Vue globale'!A15)","v":"Réseautage "}]
[{"$f":"IF('Vue globale'!A16=\"\",\"\",'Vue globale'!A16)","v":"Informatique et internet "}]
[{"$f":"IF('Vue globale'!A17=\"\",\"\",'Vue globale'!A17)","v":"Analyse et synthèse"}]
[{"$f":"IF('Vue globale'!A18=\"\",\"\",'Vue globale'!A18)","v":"Gestion de la connaissance "}]
[{"$f":"IF('Vue globale'!A19=\"\",\"\",'Vue globale'!A19)","v":"3. Marketing"}]
[{"$f":"IF('Vue globale'!A20=\"\",\"\",'Vue globale'!A20)","v":"Analyse d’opportunités "}]
[{"$f":"IF('Vue globale'!A21=\"\",\"\",'Vue globale'!A21)","v":"Etude de marché "}]
[{"$f":"IF('Vue globale'!A22=\"\",\"\",'Vue globale'!A22)","v":"Sélection de marché "}]
[{"$f":"IF('Vue globale'!A23=\"\",\"\",'Vue globale'!A23)","v":"Conception de prestations "}]
[{"$f":"IF('Vue globale'!A24=\"\",\"\",'Vue globale'!A24)","v":"Analyse de concurrence "}]
[{"$f":"IF('Vue globale'!A25=\"\",\"\",'Vue globale'!A25)","v":"Positionnement "}]
[{"$f":"IF('Vue globale'!A26=\"\",\"\",'Vue globale'!A26)","v":"Stratégie marketing"}]
[{"$f":"IF('Vue globale'!A27=\"\",\"\",'Vue globale'!A27)","v":"4. Promotion et ventes"}]
[{"$f":"IF('Vue globale'!A28=\"\",\"\",'Vue globale'!A28)","v":"Stratégie commerciale "}]
[{"$f":"IF('Vue globale'!A29=\"\",\"\",'Vue globale'!A29)","v":"Formulation de l’offre "}]
[{"$f":"IF('Vue globale'!A30=\"\",\"\",'Vue globale'!A30)","v":"Choix des canaux "}]
[{"$f":"IF('Vue globale'!A31=\"\",\"\",'Vue globale'!A31)","v":"Promotion des ventes "}]
[{"$f":"IF('Vue globale'!A32=\"\",\"\",'Vue globale'!A32)","v":"Prospection et acquisition "}]
[{"$f":"IF('Vue globale'!A33=\"\",\"\",'Vue globale'!A33)","v":"Suivi commercial "}]
[{"$f":"IF('Vue globale'!A34=\"\",\"\",'Vue globale'!A34)","v":"Fidélisation "}]
[{"$f":"IF('Vue globale'!A35=\"\",\"\",'Vue globale'!A35)","v":"5. Relations et communication institutionnelles"}]
[{"$f":"IF('Vue globale'!A36=\"\",\"\",'Vue globale'!A36)","v":"Sphère d’influence "}]
[{"$f":"IF('Vue globale'!A37=\"\",\"\",'Vue globale'!A37)","v":"Communication institutionnelle "}]
[{"$f":"IF('Vue globale'!A38=\"\",\"\",'Vue globale'!A38)","v":"Communication dans les médias "}]
[{"$f":"IF('Vue globale'!A39=\"\",\"\",'Vue globale'!A39)","v":"Réseaux sociaux "}]
[{"$f":"IF('Vue globale'!A40=\"\",\"\",'Vue globale'!A40)","v":"Gouvernance externe "}]
[{"$f":"IF('Vue globale'!A41=\"\",\"\",'Vue globale'!A41)","v":"Alliances et partenariats "}]
[{"$f":"IF('Vue globale'!A42=\"\",\"\",'Vue globale'!A42)","v":"6. Stratégie et gestion de projets"}]
[{"$f":"IF('Vue globale'!A43=\"\",\"\",'Vue globale'!A43)","v":"Vision stratégique "}]
[{"$f":"IF('Vue globale'!A44=\"\",\"\",'Vue globale'!A44)","v":"Gestion des risques "}]
[{"$f":"IF('Vue globale'!A45=\"\",\"\",'Vue globale'!A45)","v":"Stratégie de développement "}]
[{"$f":"IF('Vue globale'!A46=\"\",\"\",'Vue globale'!A46)","v":"Fixation d’objectifs "}]
[{"$f":"IF('Vue globale'!A47=\"\",\"\",'Vue globale'!A47)","v":"Mesure de résultats "}]
[{"$f":"IF('Vue globale'!A48=\"\",\"\",'Vue globale'!A48)","v":"Gestion de projets "}]
[{"$f":"IF('Vue globale'!A49=\"\",\"\",'Vue globale'!A49)","v":"Evaluation "}]
[{"$f":"IF('Vue globale'!A50=\"\",\"\",'Vue globale'!A50)","v":"7. organisation, production et logistique"}]
[{"$f":"IF('Vue globale'!A51=\"\",\"\",'Vue globale'!A51)","v":"Administration"}]
[{"$f":"IF('Vue globale'!A52=\"\",\"\",'Vue globale'!A52)","v":"Qualité"}]
[{"$f":"IF('Vue globale'!A53=\"\",\"\",'Vue globale'!A53)","v":"Ressources"}]
[{"$f":"IF('Vue globale'!A54=\"\",\"\",'Vue globale'!A54)","v":"Infrastructure"}]
[{"$f":"IF('Vue globale'!A55=\"\",\"\",'Vue globale'!A55)","v":"Négociation"}]
[{"$f":"IF('Vue globale'!A56=\"\",\"\",'Vue globale'!A56)","v":"Production"}]
[{"$f":"IF('Vue globale'!A57=\"\",\"\",'Vue globale'!A57)","v":"Distribution"}]
[{"$f":"IF('Vue globale'!A58=\"\",\"\",'Vue globale'!A58)","v":"Juridique"}]
[{"$f":"IF('Vue globale'!A59=\"\",\"\",'Vue globale'!A59)","v":"8. Gestion financière et des coûts"}]
[{"$f":"IF('Vue globale'!A60=\"\",\"\",'Vue globale'!A60)","v":"Point mort "}]
[{"$f":"IF('Vue globale'!A61=\"\",\"\",'Vue globale'!A61)","v":"Planification financière "}]
[{"$f":"IF('Vue globale'!A62=\"\",\"\",'Vue globale'!A62)","v":"Budget "}]
[{"$f":"IF('Vue globale'!A63=\"\",\"\",'Vue globale'!A63)","v":"Créanciers et débiteurs "}]
[{"$f":"IF('Vue globale'!A64=\"\",\"\",'Vue globale'!A64)","v":"Trésorerie "}]
[{"$f":"IF('Vue globale'!A65=\"\",\"\",'Vue globale'!A65)","v":"Prise de décision "}]
[{"$f":"IF('Vue globale'!A66=\"\",\"\",'Vue globale'!A66)","v":"Relations financières "}]
[{"$f":"IF('Vue globale'!A67=\"\",\"\",'Vue globale'!A67)","v":"Recherche de fonds et investisseurs"}]
[{"$f":"IF('Vue globale'!A68=\"\",\"\",'Vue globale'!A68)","v":"9. Gestion des RH et gouvernance interne"}]
[{"$f":"IF('Vue globale'!A69=\"\",\"\",'Vue globale'!A69)","v":"Politique RH"}]
[{"$f":"IF('Vue globale'!A70=\"\",\"\",'Vue globale'!A70)","v":"Gestion RH"}]
[{"$f":"IF('Vue globale'!A71=\"\",\"\",'Vue globale'!A71)","v":"Cahiers des charges"}]
[{"$f":"IF('Vue globale'!A72=\"\",\"\",'Vue globale'!A72)","v":"Management"}]
[{"$f":"IF('Vue globale'!A73=\"\",\"\",'Vue globale'!A73)","v":"Leadership"}]
[{"$f":"IF('Vue globale'!A74=\"\",\"\",'Vue globale'!A74)","v":"Participation"}]
[{"$f":"IF('Vue globale'!A75=\"\",\"\",'Vue globale'!A75)","v":"Gestion de conflits"}]
[{"$f":"IF('Vue globale'!A76=\"\",\"\",'Vue globale'!A76)","v":""}]
[{"$f":"IF('Vue globale'!A77=\"\",\"\",'Vue globale'!A77)","v":""}]
[{"$f":"IF('Vue globale'!A78=\"\",\"\",'Vue globale'!A78)","v":""}]
[{"$f":"IF('Vue globale'!A79=\"\",\"\",'Vue globale'!A79)","v":""}]
[{"$f":"IF('Vue globale'!A80=\"\",\"\",'Vue globale'!A80)","v":""}]
[{"$f":"IF('Vue globale'!A81=\"\",\"\",'Vue globale'!A81)","v":""}]
[{"$f":"IF('Vue globale'!A82=\"\",\"\",'Vue globale'!A82)","v":""}]
[{"$f":"IF('Vue globale'!A83=\"\",\"\",'Vue globale'!A83)","v":""}]
[{"$f":"IF('Vue globale'!A84=\"\",\"\",'Vue globale'!A84)","v":""}]
[{"$f":"IF('Vue globale'!A85=\"\",\"\",'Vue globale'!A85)","v":""}]
[{"$f":"IF('Vue globale'!A86=\"\",\"\",'Vue globale'!A86)","v":""}]
[{"$f":"IF('Vue globale'!A87=\"\",\"\",'Vue globale'!A87)","v":""}]
[{"$f":"IF('Vue globale'!A88=\"\",\"\",'Vue globale'!A88)","v":""}]
[{"$f":"IF('Vue globale'!A89=\"\",\"\",'Vue globale'!A89)","v":""}]
[{"$f":"IF('Vue globale'!A90=\"\",\"\",'Vue globale'!A90)","v":""}]
[{"$f":"IF('Vue globale'!A91=\"\",\"\",'Vue globale'!A91)","v":""}]
[{"$f":"IF('Vue globale'!A92=\"\",\"\",'Vue globale'!A92)","v":""}]
[{"$f":"IF('Vue globale'!A93=\"\",\"\",'Vue globale'!A93)","v":""}]
[{"$f":"IF('Vue globale'!A94=\"\",\"\",'Vue globale'!A94)","v":""}]
[{"$f":"IF('Vue globale'!A95=\"\",\"\",'Vue globale'!A95)","v":""}]
[{"$f":"IF('Vue globale'!A96=\"\",\"\",'Vue globale'!A96)","v":""}]
[{"$f":"IF('Vue globale'!A97=\"\",\"\",'Vue globale'!A97)","v":""}]
[{"$f":"IF('Vue globale'!A98=\"\",\"\",'Vue globale'!A98)","v":""}]
[{"$f":"IF('Vue globale'!A99=\"\",\"\",'Vue globale'!A99)","v":""}]
[{"$f":"IF('Vue globale'!A100=\"\",\"\",'Vue globale'!A100)","v":""}]
[{"$f":"IF('Vue globale'!A101=\"\",\"\",'Vue globale'!A101)","v":"Fin"}]
[{"$f":"IF('Vue globale'!A102=\"\",\"\",'Vue globale'!A102)","v":""}]

{"sheet":"P5","index":6,"n_rows":103,"n_cols":2,"rows_kept":103,"cut":false,"hidden":false,"merged":[[0,0,0,3]]}
["Instructions :\n - Informe ton nom. Il sera repris pour la vue globale ;\n - Pour chacune des activités (compétence) ci-dessous, choisis dans quel quadrant CPT tu la placerais ;\n - Les lignes des titres des blocs d'activités sont optionnelles."]
["Nom de la personne :","P5"]
["Activités","Quadrant CPT"]
[{"$f":"IF('Vue globale'!A3=\"\",\"\",'Vue globale'!A3)","v":"1. Conception et modélisation d’opportunités entrepreneuriales"}]
[{"$f":"IF('Vue globale'!A4=\"\",\"\",'Vue globale'!A4)","v":"Connaissance de l’environnement "}]
[{"$f":"IF('Vue globale'!A5=\"\",\"\",'Vue globale'!A5)","v":"Recherche d’opportunités "}]
[{"$f":"IF('Vue globale'!A6=\"\",\"\",'Vue globale'!A6)","v":"Mission et vision "}]
[{"$f":"IF('Vue globale'!A7=\"\",\"\",'Vue globale'!A7)","v":"Business model "}]
[{"$f":"IF('Vue globale'!A8=\"\",\"\",'Vue globale'!A8)","v":"Evaluation commerciale "}]
[{"$f":"IF('Vue globale'!A9=\"\",\"\",'Vue globale'!A9)","v":"Evaluation de mise en œuvre "}]
[{"$f":"IF('Vue globale'!A10=\"\",\"\",'Vue globale'!A10)","v":"Evaluation financière "}]
[{"$f":"IF('Vue globale'!A11=\"\",\"\",'Vue globale'!A11)","v":"2. Gestion de l’information"}]
[{"$f":"IF('Vue globale'!A12=\"\",\"\",'Vue globale'!A12)","v":"Définition des besoins "}]
[{"$f":"IF('Vue globale'!A13=\"\",\"\",'Vue globale'!A13)","v":"Identification de sources "}]
[{"$f":"IF('Vue globale'!A14=\"\",\"\",'Vue globale'!A14)","v":"Veille informationnelle"}]
[{"$f":"IF('Vue globale'!A15=\"\",\"\",'Vue globale'!A15)","v":"Réseautage "}]
[{"$f":"IF('Vue globale'!A16=\"\",\"\",'Vue globale'!A16)","v":"Informatique et internet "}]
[{"$f":"IF('Vue globale'!A17=\"\",\"\",'Vue globale'!A17)","v":"Analyse et synthèse"}]
[{"$f":"IF('Vue globale'!A18=\"\",\"\",'Vue globale'!A18)","v":"Gestion de la connaissance "}]
[{"$f":"IF('Vue globale'!A19=\"\",\"\",'Vue globale'!A19)","v":"3. Marketing"}]
[{"$f":"IF('Vue globale'!A20=\"\",\"\",'Vue globale'!A20)","v":"Analyse d’opportunités "}]
[{"$f":"IF('Vue globale'!A21=\"\",\"\",'Vue globale'!A21)","v":"Etude de marché "}]
[{"$f":"IF('Vue globale'!A22=\"\",\"\",'Vue globale'!A22)","v":"Sélection de marché "}]
[{"$f":"IF('Vue globale'!A23=\"\",\"\",'Vue globale'!A23)","v":"Conception de prestations "}]
[{"$f":"IF('Vue globale'!A24=\"\",\"\",'Vue globale'!A24)","v":"Analyse de concurrence "}]
[{"$f":"IF('Vue globale'!A25=\"\",\"\",'Vue globale'!A25)","v":"Positionnement "}]
[{"$f":"IF('Vue globale'!A26=\"\",\"\",'Vue globale'!A26)","v":"Stratégie marketing"}]
[{"$f":"IF('Vue globale'!A27=\"\",\"\",'Vue globale'!A27)","v":"4. Promotion et ventes"}]
[{"$f":"IF('Vue globale'!A28=\"\",\"\",'Vue globale'!A28)","v":"Stratégie commerciale "}]
[{"$f":"IF('Vue globale'!A29=\"\",\"\",'Vue globale'!A29)","v":"Formulation de l’offre "}]
[{"$f":"IF('Vue globale'!A30=\"\",\"\",'Vue globale'!A30)","v":"Choix des canaux "}]
[{"$f":"IF('Vue globale'!A31=\"\",\"\",'Vue globale'!A31)","v":"Promotion des ventes "}]
[{"$f":"IF('Vue globale'!A32=\"\",\"\",'Vue globale'!A32)","v":"Prospection et acquisition "}]
[{"$f":"IF('Vue globale'!A33=\"\",\"\",'Vue globale'!A33)","v":"Suivi commercial "}]
[{"$f":"IF('Vue globale'!A34=\"\",\"\",'Vue globale'!A34)","v":"Fidélisation "}]
[{"$f":"IF('Vue globale'!A35=\"\",\"\",'Vue globale'!A35)","v":"5. Relations et communication institutionnelles"}]
[{"$f":"IF('Vue globale'!A36=\"\",\"\",'Vue globale'!A36)","v":"Sphère d’influence "}]
[{"$f":"IF('Vue globale'!A37=\"\",\"\",'Vue globale'!A37)","v":"Communication institutionnelle "}]
[{"$f":"IF('Vue globale'!A38=\"\",\"\",'Vue globale'!A38)","v":"Communication dans les médias "}]
[{"$f":"IF('Vue globale'!A39=\"\",\"\",'Vue globale'!A39)","v":"Réseaux sociaux "}]
[{"$f":"IF('Vue globale'!A40=\"\",\"\",'Vue globale'!A40)","v":"Gouvernance externe "}]
[{"$f":"IF('Vue globale'!A41=\"\",\"\",'Vue globale'!A41)","v":"Alliances et partenariats "}]
[{"$f":"IF('Vue globale'!A42=\"\",\"\",'Vue globale'!A42)","v":"6. Stratégie et gestion de projets"}]
[{"$f":"IF('Vue globale'!A43=\"\",\"\",'Vue globale'!A43)","v":"Vision stratégique "}]
[{"$f":"IF('Vue globale'!A44=\"\",\"\",'Vue globale'!A44)","v":"Gestion des risques "}]
[{"$f":"IF('Vue globale'!A45=\"\",\"\",'Vue globale'!A45)","v":"Stratégie de développement "}]
[{"$f":"IF('Vue globale'!A46=\"\",\"\",'Vue globale'!A46)","v":"Fixation d’objectifs "}]
[{"$f":"IF('Vue globale'!A47=\"\",\"\",'Vue globale'!A47)","v":"Mesure de résultats "}]
[{"$f":"IF('Vue globale'!A48=\"\",\"\",'Vue globale'!A48)","v":"Gestion de projets "}]
[{"$f":"IF('Vue globale'!A49=\"\",\"\",'Vue globale'!A49)","v":"Evaluation "}]
[{"$f":"IF('Vue globale'!A50=\"\",\"\",'Vue globale'!A50)","v":"7. organisation, production et logistique"}]
[{"$f":"IF('Vue globale'!A51=\"\",\"\",'Vue globale'!A51)","v":"Administration"}]
[{"$f":"IF('Vue globale'!A52=\"\",\"\",'Vue globale'!A52)","v":"Qualité"}]
[{"$f":"IF('Vue globale'!A53=\"\",\"\",'Vue globale'!A53)","v":"Ressources"}]
[{"$f":"IF('Vue globale'!A54=\"\",\"\",'Vue globale'!A54)","v":"Infrastructure"}]
[{"$f":"IF('Vue globale'!A55=\"\",\"\",'Vue globale'!A55)","v":"Négociation"}]
[{"$f":"IF('Vue globale'!A56=\"\",\"\",'Vue globale'!A56)","v":"Production"}]
[{"$f":"IF('Vue globale'!A57=\"\",\"\",'Vue globale'!A57)","v":"Distribution"}]
[{"$f":"IF('Vue globale'!A58=\"\",\"\",'Vue globale'!A58)","v":"Juridique"}]
[{"$f":"IF('Vue globale'!A59=\"\",\"\",'Vue globale'!A59)","v":"8. Gestion financière et des coûts"}]
[{"$f":"IF('Vue globale'!A60=\"\",\"\",'Vue globale'!A60)","v":"Point mort "}]
[{"$f":"IF('Vue globale'!A61=\"\",\"\",'Vue globale'!A61)","v":"Planification financière "}]
[{"$f":"IF('Vue globale'!A62=\"\",\"\",'Vue globale'!A62)","v":"Budget "}]
[{"$f":"IF('Vue globale'!A63=\"\",\"\",'Vue globale'!A63)","v":"Créanciers et débiteurs "}]
[{"$f":"IF('Vue globale'!A64=\"\",\"\",'Vue globale'!A64)","v":"Trésorerie "}]
[{"$f":"IF('Vue globale'!A65=\"\",\"\",'Vue globale'!A65)","v":"Prise de décision "}]
[{"$f":"IF('Vue globale'!A66=\"\",\"\",'Vue globale'!A66)","v":"Relations financières "}]
[{"$f":"IF('Vue globale'!A67=\"\",\"\",'Vue globale'!A67)","v":"Recherche de fonds et investisseurs"}]
[{"$f":"IF('Vue globale'!A68=\"\",\"\",'Vue globale'!A68)","v":"9. Gestion des RH et gouvernance interne"}]
[{"$f":"IF('Vue globale'!A69=\"\",\"\",'Vue globale'!A69)","v":"Politique RH"}]
[{"$f":"IF('Vue globale'!A70=\"\",\"\",'Vue globale'!A70)","v":"Gestion RH"}]
[{"$f":"IF('Vue globale'!A71=\"\",\"\",'Vue globale'!A71)","v":"Cahiers des charges"}]
[{"$f":"IF('Vue globale'!A72=\"\",\"\",'Vue globale'!A72)","v":"Management"}]
[{"$f":"IF('Vue globale'!A73=\"\",\"\",'Vue globale'!A73)","v":"Leadership"}]
[{"$f":"IF('Vue globale'!A74=\"\",\"\",'Vue globale'!A74)","v":"Participation"}]
[{"$f":"IF('Vue globale'!A75=\"\",\"\",'Vue globale'!A75)","v":"Gestion de conflits"}]
[{"$f":"IF('Vue globale'!A76=\"\",\"\",'Vue globale'!A76)","v":""}]
[{"$f":"IF('Vue globale'!A77=\"\",\"\",'Vue globale'!A77)","v":""}]
[{"$f":"IF('Vue globale'!A78=\"\",\"\",'Vue globale'!A78)","v":""}]
[{"$f":"IF('Vue globale'!A79=\"\",\"\",'Vue globale'!A79)","v":""}]
[{"$f":"IF('Vue globale'!A80=\"\",\"\",'Vue globale'!A80)","v":""}]
[{"$f":"IF('Vue globale'!A81=\"\",\"\",'Vue globale'!A81)","v":""}]
[{"$f":"IF('Vue globale'!A82=\"\",\"\",'Vue globale'!A82)","v":""}]
[{"$f":"IF('Vue globale'!A83=\"\",\"\",'Vue globale'!A83)","v":""}]
[{"$f":"IF('Vue globale'!A84=\"\",\"\",'Vue globale'!A84)","v":""}]
[{"$f":"IF('Vue globale'!A85=\"\",\"\",'Vue globale'!A85)","v":""}]
[{"$f":"IF('Vue globale'!A86=\"\",\"\",'Vue globale'!A86)","v":""}]
[{"$f":"IF('Vue globale'!A87=\"\",\"\",'Vue globale'!A87)","v":""}]
[{"$f":"IF('Vue globale'!A88=\"\",\"\",'Vue globale'!A88)","v":""}]
[{"$f":"IF('Vue globale'!A89=\"\",\"\",'Vue globale'!A89)","v":""}]
[{"$f":"IF('Vue globale'!A90=\"\",\"\",'Vue globale'!A90)","v":""}]
[{"$f":"IF('Vue globale'!A91=\"\",\"\",'Vue globale'!A91)","v":""}]
[{"$f":"IF('Vue globale'!A92=\"\",\"\",'Vue globale'!A92)","v":""}]
[{"$f":"IF('Vue globale'!A93=\"\",\"\",'Vue globale'!A93)","v":""}]
[{"$f":"IF('Vue globale'!A94=\"\",\"\",'Vue globale'!A94)","v":""}]
[{"$f":"IF('Vue globale'!A95=\"\",\"\",'Vue globale'!A95)","v":""}]
[{"$f":"IF('Vue globale'!A96=\"\",\"\",'Vue globale'!A96)","v":""}]
[{"$f":"IF('Vue globale'!A97=\"\",\"\",'Vue globale'!A97)","v":""}]
[{"$f":"IF('Vue globale'!A98=\"\",\"\",'Vue globale'!A98)","v":""}]
[{"$f":"IF('Vue globale'!A99=\"\",\"\",'Vue globale'!A99)","v":""}]
[{"$f":"IF('Vue globale'!A100=\"\",\"\",'Vue globale'!A100)","v":""}]
[{"$f":"IF('Vue globale'!A101=\"\",\"\",'Vue globale'!A101)","v":"Fin"}]
[{"$f":"IF('Vue globale'!A102=\"\",\"\",'Vue globale'!A102)","v":""}]

{"sheet":"P6","index":7,"n_rows":103,"n_cols":2,"rows_kept":103,"cut":false,"hidden":false,"merged":[[0,0,0,3]]}
["Instructions :\n - Informe ton nom. Il sera repris pour la vue globale ;\n - Pour chacune des activités (compétence) ci-dessous, choisis dans quel quadrant CPT tu la placerais ;\n - Les lignes des titres des blocs d'activités sont optionnelles."]
["Nom de la personne :","P6"]
["Activités","Quadrant CPT"]
[{"$f":"IF('Vue globale'!A3=\"\",\"\",'Vue globale'!A3)","v":"1. Conception et modélisation d’opportunités entrepreneuriales"}]
[{"$f":"IF('Vue globale'!A4=\"\",\"\",'Vue globale'!A4)","v":"Connaissance de l’environnement "}]
[{"$f":"IF('Vue globale'!A5=\"\",\"\",'Vue globale'!A5)","v":"Recherche d’opportunités "}]
[{"$f":"IF('Vue globale'!A6=\"\",\"\",'Vue globale'!A6)","v":"Mission et vision "}]
[{"$f":"IF('Vue globale'!A7=\"\",\"\",'Vue globale'!A7)","v":"Business model "}]
[{"$f":"IF('Vue globale'!A8=\"\",\"\",'Vue globale'!A8)","v":"Evaluation commerciale "}]
[{"$f":"IF('Vue globale'!A9=\"\",\"\",'Vue globale'!A9)","v":"Evaluation de mise en œuvre "}]
[{"$f":"IF('Vue globale'!A10=\"\",\"\",'Vue globale'!A10)","v":"Evaluation financière "}]
[{"$f":"IF('Vue globale'!A11=\"\",\"\",'Vue globale'!A11)","v":"2. Gestion de l’information"}]
[{"$f":"IF('Vue globale'!A12=\"\",\"\",'Vue globale'!A12)","v":"Définition des besoins "}]
[{"$f":"IF('Vue globale'!A13=\"\",\"\",'Vue globale'!A13)","v":"Identification de sources "}]
[{"$f":"IF('Vue globale'!A14=\"\",\"\",'Vue globale'!A14)","v":"Veille informationnelle"}]
[{"$f":"IF('Vue globale'!A15=\"\",\"\",'Vue globale'!A15)","v":"Réseautage "}]
[{"$f":"IF('Vue globale'!A16=\"\",\"\",'Vue globale'!A16)","v":"Informatique et internet "}]
[{"$f":"IF('Vue globale'!A17=\"\",\"\",'Vue globale'!A17)","v":"Analyse et synthèse"}]
[{"$f":"IF('Vue globale'!A18=\"\",\"\",'Vue globale'!A18)","v":"Gestion de la connaissance "}]
[{"$f":"IF('Vue globale'!A19=\"\",\"\",'Vue globale'!A19)","v":"3. Marketing"}]
[{"$f":"IF('Vue globale'!A20=\"\",\"\",'Vue globale'!A20)","v":"Analyse d’opportunités "}]
[{"$f":"IF('Vue globale'!A21=\"\",\"\",'Vue globale'!A21)","v":"Etude de marché "}]
[{"$f":"IF('Vue globale'!A22=\"\",\"\",'Vue globale'!A22)","v":"Sélection de marché "}]
[{"$f":"IF('Vue globale'!A23=\"\",\"\",'Vue globale'!A23)","v":"Conception de prestations "}]
[{"$f":"IF('Vue globale'!A24=\"\",\"\",'Vue globale'!A24)","v":"Analyse de concurrence "}]
[{"$f":"IF('Vue globale'!A25=\"\",\"\",'Vue globale'!A25)","v":"Positionnement "}]
[{"$f":"IF('Vue globale'!A26=\"\",\"\",'Vue globale'!A26)","v":"Stratégie marketing"}]
[{"$f":"IF('Vue globale'!A27=\"\",\"\",'Vue globale'!A27)","v":"4. Promotion et ventes"}]
[{"$f":"IF('Vue globale'!A28=\"\",\"\",'Vue globale'!A28)","v":"Stratégie commerciale "}]
[{"$f":"IF('Vue globale'!A29=\"\",\"\",'Vue globale'!A29)","v":"Formulation de l’offre "}]
[{"$f":"IF('Vue globale'!A30=\"\",\"\",'Vue globale'!A30)","v":"Choix des canaux "}]
[{"$f":"IF('Vue globale'!A31=\"\",\"\",'Vue globale'!A31)","v":"Promotion des ventes "}]
[{"$f":"IF('Vue globale'!A32=\"\",\"\",'Vue globale'!A32)","v":"Prospection et acquisition "}]
[{"$f":"IF('Vue globale'!A33=\"\",\"\",'Vue globale'!A33)","v":"Suivi commercial "}]
[{"$f":"IF('Vue globale'!A34=\"\",\"\",'Vue globale'!A34)","v":"Fidélisation "}]
[{"$f":"IF('Vue globale'!A35=\"\",\"\",'Vue globale'!A35)","v":"5. Relations et communication institutionnelles"}]
[{"$f":"IF('Vue globale'!A36=\"\",\"\",'Vue globale'!A36)","v":"Sphère d’influence "}]
[{"$f":"IF('Vue globale'!A37=\"\",\"\",'Vue globale'!A37)","v":"Communication institutionnelle "}]
[{"$f":"IF('Vue globale'!A38=\"\",\"\",'Vue globale'!A38)","v":"Communication dans les médias "}]
[{"$f":"IF('Vue globale'!A39=\"\",\"\",'Vue globale'!A39)","v":"Réseaux sociaux "}]
[{"$f":"IF('Vue globale'!A40=\"\",\"\",'Vue globale'!A40)","v":"Gouvernance externe "}]
[{"$f":"IF('Vue globale'!A41=\"\",\"\",'Vue globale'!A41)","v":"Alliances et partenariats "}]
[{"$f":"IF('Vue globale'!A42=\"\",\"\",'Vue globale'!A42)","v":"6. Stratégie et gestion de projets"}]
[{"$f":"IF('Vue globale'!A43=\"\",\"\",'Vue globale'!A43)","v":"Vision stratégique "}]
[{"$f":"IF('Vue globale'!A44=\"\",\"\",'Vue globale'!A44)","v":"Gestion des risques "}]
[{"$f":"IF('Vue globale'!A45=\"\",\"\",'Vue globale'!A45)","v":"Stratégie de développement "}]
[{"$f":"IF('Vue globale'!A46=\"\",\"\",'Vue globale'!A46)","v":"Fixation d’objectifs "}]
[{"$f":"IF('Vue globale'!A47=\"\",\"\",'Vue globale'!A47)","v":"Mesure de résultats "}]
[{"$f":"IF('Vue globale'!A48=\"\",\"\",'Vue globale'!A48)","v":"Gestion de projets "}]
[{"$f":"IF('Vue globale'!A49=\"\",\"\",'Vue globale'!A49)","v":"Evaluation "}]
[{"$f":"IF('Vue globale'!A50=\"\",\"\",'Vue globale'!A50)","v":"7. organisation, production et logistique"}]
[{"$f":"IF('Vue globale'!A51=\"\",\"\",'Vue globale'!A51)","v":"Administration"}]
[{"$f":"IF('Vue globale'!A52=\"\",\"\",'Vue globale'!A52)","v":"Qualité"}]
[{"$f":"IF('Vue globale'!A53=\"\",\"\",'Vue globale'!A53)","v":"Ressources"}]
[{"$f":"IF('Vue globale'!A54=\"\",\"\",'Vue globale'!A54)","v":"Infrastructure"}]
[{"$f":"IF('Vue globale'!A55=\"\",\"\",'Vue globale'!A55)","v":"Négociation"}]
[{"$f":"IF('Vue globale'!A56=\"\",\"\",'Vue globale'!A56)","v":"Production"}]
[{"$f":"IF('Vue globale'!A57=\"\",\"\",'Vue globale'!A57)","v":"Distribution"}]
[{"$f":"IF('Vue globale'!A58=\"\",\"\",'Vue globale'!A58)","v":"Juridique"}]
[{"$f":"IF('Vue globale'!A59=\"\",\"\",'Vue globale'!A59)","v":"8. Gestion financière et des coûts"}]
[{"$f":"IF('Vue globale'!A60=\"\",\"\",'Vue globale'!A60)","v":"Point mort "}]
[{"$f":"IF('Vue globale'!A61=\"\",\"\",'Vue globale'!A61)","v":"Planification financière "}]
[{"$f":"IF('Vue globale'!A62=\"\",\"\",'Vue globale'!A62)","v":"Budget "}]
[{"$f":"IF('Vue globale'!A63=\"\",\"\",'Vue globale'!A63)","v":"Créanciers et débiteurs "}]
[{"$f":"IF('Vue globale'!A64=\"\",\"\",'Vue globale'!A64)","v":"Trésorerie "}]
[{"$f":"IF('Vue globale'!A65=\"\",\"\",'Vue globale'!A65)","v":"Prise de décision "}]
[{"$f":"IF('Vue globale'!A66=\"\",\"\",'Vue globale'!A66)","v":"Relations financières "}]
[{"$f":"IF('Vue globale'!A67=\"\",\"\",'Vue globale'!A67)","v":"Recherche de fonds et investisseurs"}]
[{"$f":"IF('Vue globale'!A68=\"\",\"\",'Vue globale'!A68)","v":"9. Gestion des RH et gouvernance interne"}]
[{"$f":"IF('Vue globale'!A69=\"\",\"\",'Vue globale'!A69)","v":"Politique RH"}]
[{"$f":"IF('Vue globale'!A70=\"\",\"\",'Vue globale'!A70)","v":"Gestion RH"}]
[{"$f":"IF('Vue globale'!A71=\"\",\"\",'Vue globale'!A71)","v":"Cahiers des charges"}]
[{"$f":"IF('Vue globale'!A72=\"\",\"\",'Vue globale'!A72)","v":"Management"}]
[{"$f":"IF('Vue globale'!A73=\"\",\"\",'Vue globale'!A73)","v":"Leadership"}]
[{"$f":"IF('Vue globale'!A74=\"\",\"\",'Vue globale'!A74)","v":"Participation"}]
[{"$f":"IF('Vue globale'!A75=\"\",\"\",'Vue globale'!A75)","v":"Gestion de conflits"}]
[{"$f":"IF('Vue globale'!A76=\"\",\"\",'Vue globale'!A76)","v":""}]
[{"$f":"IF('Vue globale'!A77=\"\",\"\",'Vue globale'!A77)","v":""}]
[{"$f":"IF('Vue globale'!A78=\"\",\"\",'Vue globale'!A78)","v":""}]
[{"$f":"IF('Vue globale'!A79=\"\",\"\",'Vue globale'!A79)","v":""}]
[{"$f":"IF('Vue globale'!A80=\"\",\"\",'Vue globale'!A80)","v":""}]
[{"$f":"IF('Vue globale'!A81=\"\",\"\",'Vue globale'!A81)","v":""}]
[{"$f":"IF('Vue globale'!A82=\"\",\"\",'Vue globale'!A82)","v":""}]
[{"$f":"IF('Vue globale'!A83=\"\",\"\",'Vue globale'!A83)","v":""}]
[{"$f":"IF('Vue globale'!A84=\"\",\"\",'Vue globale'!A84)","v":""}]
[{"$f":"IF('Vue globale'!A85=\"\",\"\",'Vue globale'!A85)","v":""}]
[{"$f":"IF('Vue globale'!A86=\"\",\"\",'Vue globale'!A86)","v":""}]
[{"$f":"IF('Vue globale'!A87=\"\",\"\",'Vue globale'!A87)","v":""}]
[{"$f":"IF('Vue globale'!A88=\"\",\"\",'Vue globale'!A88)","v":""}]
[{"$f":"IF('Vue globale'!A89=\"\",\"\",'Vue globale'!A89)","v":""}]
[{"$f":"IF('Vue globale'!A90=\"\",\"\",'Vue globale'!A90)","v":""}]
[{"$f":"IF('Vue globale'!A91=\"\",\"\",'Vue globale'!A91)","v":""}]
[{"$f":"IF('Vue globale'!A92=\"\",\"\",'Vue globale'!A92)","v":""}]
[{"$f":"IF('Vue globale'!A93=\"\",\"\",'Vue globale'!A93)","v":""}]
[{"$f":"IF('Vue globale'!A94=\"\",\"\",'Vue globale'!A94)","v":""}]
[{"$f":"IF('Vue globale'!A95=\"\",\"\",'Vue globale'!A95)","v":""}]
[{"$f":"IF('Vue globale'!A96=\"\",\"\",'Vue globale'!A96)","v":""}]
[{"$f":"IF('Vue globale'!A97=\"\",\"\",'Vue globale'!A97)","v":""}]
[{"$f":"IF('Vue globale'!A98=\"\",\"\",'Vue globale'!A98)","v":""}]
[{"$f":"IF('Vue globale'!A99=\"\",\"\",'Vue globale'!A99)","v":""}]
[{"$f":"IF('Vue globale'!A100=\"\",\"\",'Vue globale'!A100)","v":""}]
[{"$f":"IF('Vue globale'!A101=\"\",\"\",'Vue globale'!A101)","v":"Fin"}]
[{"$f":"IF('Vue globale'!A102=\"\",\"\",'Vue globale'!A102)","v":""}]

{"sheet":"P7","index":8,"n_rows":103,"n_cols":2,"rows_kept":103,"cut":false,"hidden":false,"merged":[[0,0,0,3]]}
["Instructions :\n - Informe ton nom. Il sera repris pour la vue globale ;\n - Pour chacune des activités (compétence) ci-dessous, choisis dans quel quadrant CPT tu la placerais ;\n - Les lignes des titres des blocs d'activités sont optionnelles."]
["Nom de la personne :","P7"]
["Activités","Quadrant CPT"]
[{"$f":"IF('Vue globale'!A3=\"\",\"\",'Vue globale'!A3)","v":"1. Conception et modélisation d’opportunités entrepreneuriales"}]
[{"$f":"IF('Vue globale'!A4=\"\",\"\",'Vue globale'!A4)","v":"Connaissance de l’environnement "}]
[{"$f":"IF('Vue globale'!A5=\"\",\"\",'Vue globale'!A5)","v":"Recherche d’opportunités "}]
[{"$f":"IF('Vue globale'!A6=\"\",\"\",'Vue globale'!A6)","v":"Mission et vision "}]
[{"$f":"IF('Vue globale'!A7=\"\",\"\",'Vue globale'!A7)","v":"Business model "}]
[{"$f":"IF('Vue globale'!A8=\"\",\"\",'Vue globale'!A8)","v":"Evaluation commerciale "}]
[{"$f":"IF('Vue globale'!A9=\"\",\"\",'Vue globale'!A9)","v":"Evaluation de mise en œuvre "}]
[{"$f":"IF('Vue globale'!A10=\"\",\"\",'Vue globale'!A10)","v":"Evaluation financière "}]
[{"$f":"IF('Vue globale'!A11=\"\",\"\",'Vue globale'!A11)","v":"2. Gestion de l’information"}]
[{"$f":"IF('Vue globale'!A12=\"\",\"\",'Vue globale'!A12)","v":"Définition des besoins "}]
[{"$f":"IF('Vue globale'!A13=\"\",\"\",'Vue globale'!A13)","v":"Identification de sources "}]
[{"$f":"IF('Vue globale'!A14=\"\",\"\",'Vue globale'!A14)","v":"Veille informationnelle"}]
[{"$f":"IF('Vue globale'!A15=\"\",\"\",'Vue globale'!A15)","v":"Réseautage "}]
[{"$f":"IF('Vue globale'!A16=\"\",\"\",'Vue globale'!A16)","v":"Informatique et internet "}]
[{"$f":"IF('Vue globale'!A17=\"\",\"\",'Vue globale'!A17)","v":"Analyse et synthèse"}]
[{"$f":"IF('Vue globale'!A18=\"\",\"\",'Vue globale'!A18)","v":"Gestion de la connaissance "}]
[{"$f":"IF('Vue globale'!A19=\"\",\"\",'Vue globale'!A19)","v":"3. Marketing"}]
[{"$f":"IF('Vue globale'!A20=\"\",\"\",'Vue globale'!A20)","v":"Analyse d’opportunités "}]
[{"$f":"IF('Vue globale'!A21=\"\",\"\",'Vue globale'!A21)","v":"Etude de marché "}]
[{"$f":"IF('Vue globale'!A22=\"\",\"\",'Vue globale'!A22)","v":"Sélection de marché "}]
[{"$f":"IF('Vue globale'!A23=\"\",\"\",'Vue globale'!A23)","v":"Conception de prestations "}]
[{"$f":"IF('Vue globale'!A24=\"\",\"\",'Vue globale'!A24)","v":"Analyse de concurrence "}]
[{"$f":"IF('Vue globale'!A25=\"\",\"\",'Vue globale'!A25)","v":"Positionnement "}]
[{"$f":"IF('Vue globale'!A26=\"\",\"\",'Vue globale'!A26)","v":"Stratégie marketing"}]
[{"$f":"IF('Vue globale'!A27=\"\",\"\",'Vue globale'!A27)","v":"4. Promotion et ventes"}]
[{"$f":"IF('Vue globale'!A28=\"\",\"\",'Vue globale'!A28)","v":"Stratégie commerciale "}]
[{"$f":"IF('Vue globale'!A29=\"\",\"\",'Vue globale'!A29)","v":"Formulation de l’offre "}]
[{"$f":"IF('Vue globale'!A30=\"\",\"\",'Vue globale'!A30)","v":"Choix des canaux "}]
[{"$f":"IF('Vue globale'!A31=\"\",\"\",'Vue globale'!A31)","v":"Promotion des ventes "}]
[{"$f":"IF('Vue globale'!A32=\"\",\"\",'Vue globale'!A32)","v":"Prospection et acquisition "}]
[{"$f":"IF('Vue globale'!A33=\"\",\"\",'Vue globale'!A33)","v":"Suivi commercial "}]
[{"$f":"IF('Vue globale'!A34=\"\",\"\",'Vue globale'!A34)","v":"Fidélisation "}]
[{"$f":"IF('Vue globale'!A35=\"\",\"\",'Vue globale'!A35)","v":"5. Relations et communication institutionnelles"}]
[{"$f":"IF('Vue globale'!A36=\"\",\"\",'Vue globale'!A36)","v":"Sphère d’influence "}]
[{"$f":"IF('Vue globale'!A37=\"\",\"\",'Vue globale'!A37)","v":"Communication institutionnelle "}]
[{"$f":"IF('Vue globale'!A38=\"\",\"\",'Vue globale'!A38)","v":"Communication dans les médias "}]
[{"$f":"IF('Vue globale'!A39=\"\",\"\",'Vue globale'!A39)","v":"Réseaux sociaux "}]
[{"$f":"IF('Vue globale'!A40=\"\",\"\",'Vue globale'!A40)","v":"Gouvernance externe "}]
[{"$f":"IF('Vue globale'!A41=\"\",\"\",'Vue globale'!A41)","v":"Alliances et partenariats "}]
[{"$f":"IF('Vue globale'!A42=\"\",\"\",'Vue globale'!A42)","v":"6. Stratégie et gestion de projets"}]
[{"$f":"IF('Vue globale'!A43=\"\",\"\",'Vue globale'!A43)","v":"Vision stratégique "}]
[{"$f":"IF('Vue globale'!A44=\"\",\"\",'Vue globale'!A44)","v":"Gestion des risques "}]
[{"$f":"IF('Vue globale'!A45=\"\",\"\",'Vue globale'!A45)","v":"Stratégie de développement "}]
[{"$f":"IF('Vue globale'!A46=\"\",\"\",'Vue globale'!A46)","v":"Fixation d’objectifs "}]
[{"$f":"IF('Vue globale'!A47=\"\",\"\",'Vue globale'!A47)","v":"Mesure de résultats "}]
[{"$f":"IF('Vue globale'!A48=\"\",\"\",'Vue globale'!A48)","v":"Gestion de projets "}]
[{"$f":"IF('Vue globale'!A49=\"\",\"\",'Vue globale'!A49)","v":"Evaluation "}]
[{"$f":"IF('Vue globale'!A50=\"\",\"\",'Vue globale'!A50)","v":"7. organisation, production et logistique"}]
[{"$f":"IF('Vue globale'!A51=\"\",\"\",'Vue globale'!A51)","v":"Administration"}]
[{"$f":"IF('Vue globale'!A52=\"\",\"\",'Vue globale'!A52)","v":"Qualité"}]
[{"$f":"IF('Vue globale'!A53=\"\",\"\",'Vue globale'!A53)","v":"Ressources"}]
[{"$f":"IF('Vue globale'!A54=\"\",\"\",'Vue globale'!A54)","v":"Infrastructure"}]
[{"$f":"IF('Vue globale'!A55=\"\",\"\",'Vue globale'!A55)","v":"Négociation"}]
[{"$f":"IF('Vue globale'!A56=\"\",\"\",'Vue globale'!A56)","v":"Production"}]
[{"$f":"IF('Vue globale'!A57=\"\",\"\",'Vue globale'!A57)","v":"Distribution"}]
[{"$f":"IF('Vue globale'!A58=\"\",\"\",'Vue globale'!A58)","v":"Juridique"}]
[{"$f":"IF('Vue globale'!A59=\"\",\"\",'Vue globale'!A59)","v":"8. Gestion financière et des coûts"}]
[{"$f":"IF('Vue globale'!A60=\"\",\"\",'Vue globale'!A60)","v":"Point mort "}]
[{"$f":"IF('Vue globale'!A61=\"\",\"\",'Vue globale'!A61)","v":"Planification financière "}]
[{"$f":"IF('Vue globale'!A62=\"\",\"\",'Vue globale'!A62)","v":"Budget "}]
[{"$f":"IF('Vue globale'!A63=\"\",\"\",'Vue globale'!A63)","v":"Créanciers et débiteurs "}]
[{"$f":"IF('Vue globale'!A64=\"\",\"\",'Vue globale'!A64)","v":"Trésorerie "}]
[{"$f":"IF('Vue globale'!A65=\"\",\"\",'Vue globale'!A65)","v":"Prise de décision "}]
[{"$f":"IF('Vue globale'!A66=\"\",\"\",'Vue globale'!A66)","v":"Relations financières "}]
[{"$f":"IF('Vue globale'!A67=\"\",\"\",'Vue globale'!A67)","v":"Recherche de fonds et investisseurs"}]
[{"$f":"IF('Vue globale'!A68=\"\",\"\",'Vue globale'!A68)","v":"9. Gestion des RH et gouvernance interne"}]
[{"$f":"IF('Vue globale'!A69=\"\",\"\",'Vue globale'!A69)","v":"Politique RH"}]
[{"$f":"IF('Vue globale'!A70=\"\",\"\",'Vue globale'!A70)","v":"Gestion RH"}]
[{"$f":"IF('Vue globale'!A71=\"\",\"\",'Vue globale'!A71)","v":"Cahiers des charges"}]
[{"$f":"IF('Vue globale'!A72=\"\",\"\",'Vue globale'!A72)","v":"Management"}]
[{"$f":"IF('Vue globale'!A73=\"\",\"\",'Vue globale'!A73)","v":"Leadership"}]
[{"$f":"IF('Vue globale'!A74=\"\",\"\",'Vue globale'!A74)","v":"Participation"}]
[{"$f":"IF('Vue globale'!A75=\"\",\"\",'Vue globale'!A75)","v":"Gestion de conflits"}]
[{"$f":"IF('Vue globale'!A76=\"\",\"\",'Vue globale'!A76)","v":""}]
[{"$f":"IF('Vue globale'!A77=\"\",\"\",'Vue globale'!A77)","v":""}]
[{"$f":"IF('Vue globale'!A78=\"\",\"\",'Vue globale'!A78)","v":""}]
[{"$f":"IF('Vue globale'!A79=\"\",\"\",'Vue globale'!A79)","v":""}]
[{"$f":"IF('Vue globale'!A80=\"\",\"\",'Vue globale'!A80)","v":""}]
[{"$f":"IF('Vue globale'!A81=\"\",\"\",'Vue globale'!A81)","v":""}]
[{"$f":"IF('Vue globale'!A82=\"\",\"\",'Vue globale'!A82)","v":""}]
[{"$f":"IF('Vue globale'!A83=\"\",\"\",'Vue globale'!A83)","v":""}]
[{"$f":"IF('Vue globale'!A84=\"\",\"\",'Vue globale'!A84)","v":""}]
[{"$f":"IF('Vue globale'!A85=\"\",\"\",'Vue globale'!A85)","v":""}]
[{"$f":"IF('Vue globale'!A86=\"\",\"\",'Vue globale'!A86)","v":""}]
[{"$f":"IF('Vue globale'!A87=\"\",\"\",'Vue globale'!A87)","v":""}]
[{"$f":"IF('Vue globale'!A88=\"\",\"\",'Vue globale'!A88)","v":""}]
[{"$f":"IF('Vue globale'!A89=\"\",\"\",'Vue globale'!A89)","v":""}]
[{"$f":"IF('Vue globale'!A90=\"\",\"\",'Vue globale'!A90)","v":""}]
[{"$f":"IF('Vue globale'!A91=\"\",\"\",'Vue globale'!A91)","v":""}]
[{"$f":"IF('Vue globale'!A92=\"\",\"\",'Vue globale'!A92)","v":""}]
[{"$f":"IF('Vue globale'!A93=\"\",\"\",'Vue globale'!A93)","v":""}]
[{"$f":"IF('Vue globale'!A94=\"\",\"\",'Vue globale'!A94)","v":""}]
[{"$f":"IF('Vue globale'!A95=\"\",\"\",'Vue globale'!A95)","v":""}]
[{"$f":"IF('Vue globale'!A96=\"\",\"\",'Vue globale'!A96)","v":""}]
[{"$f":"IF('Vue globale'!A97=\"\",\"\",'Vue globale'!A97)","v":""}]
[{"$f":"IF('Vue globale'!A98=\"\",\"\",'Vue globale'!A98)","v":""}]
[{"$f":"IF('Vue globale'!A99=\"\",\"\",'Vue globale'!A99)","v":""}]
[{"$f":"IF('Vue globale'!A100=\"\",\"\",'Vue globale'!A100)","v":""}]
[{"$f":"IF('Vue globale'!A101=\"\",\"\",'Vue globale'!A101)","v":"Fin"}]
[{"$f":"IF('Vue globale'!A102=\"\",\"\",'Vue globale'!A102)","v":""}]

{"sheet":"P8","index":9,"n_rows":103,"n_cols":2,"rows_kept":103,"cut":false,"hidden":false,"merged":[[0,0,0,3]]}
["Instructions :\n - Informe ton nom. Il sera repris pour la vue globale ;\n - Pour chacune des activités (compétence) ci-dessous, choisis dans quel quadrant CPT tu la placerais ;\n - Les lignes des titres des blocs d'activités sont optionnelles."]
["Nom de la personne :","P8"]
["Activités","Quadrant CPT"]
[{"$f":"IF('Vue globale'!A3=\"\",\"\",'Vue globale'!A3)","v":"1. Conception et modélisation d’opportunités entrepreneuriales"}]
[{"$f":"IF('Vue globale'!A4=\"\",\"\",'Vue globale'!A4)","v":"Connaissance de l’environnement "}]
[{"$f":"IF('Vue globale'!A5=\"\",\"\",'Vue globale'!A5)","v":"Recherche d’opportunités "}]
[{"$f":"IF('Vue globale'!A6=\"\",\"\",'Vue globale'!A6)","v":"Mission et vision "}]
[{"$f":"IF('Vue globale'!A7=\"\",\"\",'Vue globale'!A7)","v":"Business model "}]
[{"$f":"IF('Vue globale'!A8=\"\",\"\",'Vue globale'!A8)","v":"Evaluation commerciale "}]
[{"$f":"IF('Vue globale'!A9=\"\",\"\",'Vue globale'!A9)","v":"Evaluation de mise en œuvre "}]
[{"$f":"IF('Vue globale'!A10=\"\",\"\",'Vue globale'!A10)","v":"Evaluation financière "}]
[{"$f":"IF('Vue globale'!A11=\"\",\"\",'Vue globale'!A11)","v":"2. Gestion de l’information"}]
[{"$f":"IF('Vue globale'!A12=\"\",\"\",'Vue globale'!A12)","v":"Définition des besoins "}]
[{"$f":"IF('Vue globale'!A13=\"\",\"\",'Vue globale'!A13)","v":"Identification de sources "}]
[{"$f":"IF('Vue globale'!A14=\"\",\"\",'Vue globale'!A14)","v":"Veille informationnelle"}]
[{"$f":"IF('Vue globale'!A15=\"\",\"\",'Vue globale'!A15)","v":"Réseautage "}]
[{"$f":"IF('Vue globale'!A16=\"\",\"\",'Vue globale'!A16)","v":"Informatique et internet "}]
[{"$f":"IF('Vue globale'!A17=\"\",\"\",'Vue globale'!A17)","v":"Analyse et synthèse"}]
[{"$f":"IF('Vue globale'!A18=\"\",\"\",'Vue globale'!A18)","v":"Gestion de la connaissance "}]
[{"$f":"IF('Vue globale'!A19=\"\",\"\",'Vue globale'!A19)","v":"3. Marketing"}]
[{"$f":"IF('Vue globale'!A20=\"\",\"\",'Vue globale'!A20)","v":"Analyse d’opportunités "}]
[{"$f":"IF('Vue globale'!A21=\"\",\"\",'Vue globale'!A21)","v":"Etude de marché "}]
[{"$f":"IF('Vue globale'!A22=\"\",\"\",'Vue globale'!A22)","v":"Sélection de marché "}]
[{"$f":"IF('Vue globale'!A23=\"\",\"\",'Vue globale'!A23)","v":"Conception de prestations "}]
[{"$f":"IF('Vue globale'!A24=\"\",\"\",'Vue globale'!A24)","v":"Analyse de concurrence "}]
[{"$f":"IF('Vue globale'!A25=\"\",\"\",'Vue globale'!A25)","v":"Positionnement "}]
[{"$f":"IF('Vue globale'!A26=\"\",\"\",'Vue globale'!A26)","v":"Stratégie marketing"}]
[{"$f":"IF('Vue globale'!A27=\"\",\"\",'Vue globale'!A27)","v":"4. Promotion et ventes"}]
[{"$f":"IF('Vue globale'!A28=\"\",\"\",'Vue globale'!A28)","v":"Stratégie commerciale "}]
[{"$f":"IF('Vue globale'!A29=\"\",\"\",'Vue globale'!A29)","v":"Formulation de l’offre "}]
[{"$f":"IF('Vue globale'!A30=\"\",\"\",'Vue globale'!A30)","v":"Choix des canaux "}]
[{"$f":"IF('Vue globale'!A31=\"\",\"\",'Vue globale'!A31)","v":"Promotion des ventes "}]
[{"$f":"IF('Vue globale'!A32=\"\",\"\",'Vue globale'!A32)","v":"Prospection et acquisition "}]
[{"$f":"IF('Vue globale'!A33=\"\",\"\",'Vue globale'!A33)","v":"Suivi commercial "}]
[{"$f":"IF('Vue globale'!A34=\"\",\"\",'Vue globale'!A34)","v":"Fidélisation "}]
[{"$f":"IF('Vue globale'!A35=\"\",\"\",'Vue globale'!A35)","v":"5. Relations et communication institutionnelles"}]
[{"$f":"IF('Vue globale'!A36=\"\",\"\",'Vue globale'!A36)","v":"Sphère d’influence "}]
[{"$f":"IF('Vue globale'!A37=\"\",\"\",'Vue globale'!A37)","v":"Communication institutionnelle "}]
[{"$f":"IF('Vue globale'!A38=\"\",\"\",'Vue globale'!A38)","v":"Communication dans les médias "}]
[{"$f":"IF('Vue globale'!A39=\"\",\"\",'Vue globale'!A39)","v":"Réseaux sociaux "}]
[{"$f":"IF('Vue globale'!A40=\"\",\"\",'Vue globale'!A40)","v":"Gouvernance externe "}]
[{"$f":"IF('Vue globale'!A41=\"\",\"\",'Vue globale'!A41)","v":"Alliances et partenariats "}]
[{"$f":"IF('Vue globale'!A42=\"\",\"\",'Vue globale'!A42)","v":"6. Stratégie et gestion de projets"}]
[{"$f":"IF('Vue globale'!A43=\"\",\"\",'Vue globale'!A43)","v":"Vision stratégique "}]
[{"$f":"IF('Vue globale'!A44=\"\",\"\",'Vue globale'!A44)","v":"Gestion des risques "}]
[{"$f":"IF('Vue globale'!A45=\"\",\"\",'Vue globale'!A45)","v":"Stratégie de développement "}]
[{"$f":"IF('Vue globale'!A46=\"\",\"\",'Vue globale'!A46)","v":"Fixation d’objectifs "}]
[{"$f":"IF('Vue globale'!A47=\"\",\"\",'Vue globale'!A47)","v":"Mesure de résultats "}]
[{"$f":"IF('Vue globale'!A48=\"\",\"\",'Vue globale'!A48)","v":"Gestion de projets "}]
[{"$f":"IF('Vue globale'!A49=\"\",\"\",'Vue globale'!A49)","v":"Evaluation "}]
[{"$f":"IF('Vue globale'!A50=\"\",\"\",'Vue globale'!A50)","v":"7. organisation, production et logistique"}]
[{"$f":"IF('Vue globale'!A51=\"\",\"\",'Vue globale'!A51)","v":"Administration"}]
[{"$f":"IF('Vue globale'!A52=\"\",\"\",'Vue globale'!A52)","v":"Qualité"}]
[{"$f":"IF('Vue globale'!A53=\"\",\"\",'Vue globale'!A53)","v":"Ressources"}]
[{"$f":"IF('Vue globale'!A54=\"\",\"\",'Vue globale'!A54)","v":"Infrastructure"}]
[{"$f":"IF('Vue globale'!A55=\"\",\"\",'Vue globale'!A55)","v":"Négociation"}]
[{"$f":"IF('Vue globale'!A56=\"\",\"\",'Vue globale'!A56)","v":"Production"}]
[{"$f":"IF('Vue globale'!A57=\"\",\"\",'Vue globale'!A57)","v":"Distribution"}]
[{"$f":"IF('Vue globale'!A58=\"\",\"\",'Vue globale'!A58)","v":"Juridique"}]
[{"$f":"IF('Vue globale'!A59=\"\",\"\",'Vue globale'!A59)","v":"8. Gestion financière et des coûts"}]
[{"$f":"IF('Vue globale'!A60=\"\",\"\",'Vue globale'!A60)","v":"Point mort "}]
[{"$f":"IF('Vue globale'!A61=\"\",\"\",'Vue globale'!A61)","v":"Planification financière "}]
[{"$f":"IF('Vue globale'!A62=\"\",\"\",'Vue globale'!A62)","v":"Budget "}]
[{"$f":"IF('Vue globale'!A63=\"\",\"\",'Vue globale'!A63)","v":"Créanciers et débiteurs "}]
[{"$f":"IF('Vue globale'!A64=\"\",\"\",'Vue globale'!A64)","v":"Trésorerie "}]
[{"$f":"IF('Vue globale'!A65=\"\",\"\",'Vue globale'!A65)","v":"Prise de décision "}]
[{"$f":"IF('Vue globale'!A66=\"\",\"\",'Vue globale'!A66)","v":"Relations financières "}]
[{"$f":"IF('Vue globale'!A67=\"\",\"\",'Vue globale'!A67)","v":"Recherche de fonds et investisseurs"}]
[{"$f":"IF('Vue globale'!A68=\"\",\"\",'Vue globale'!A68)","v":"9. Gestion des RH et gouvernance interne"}]
[{"$f":"IF('Vue globale'!A69=\"\",\"\",'Vue globale'!A69)","v":"Politique RH"}]
[{"$f":"IF('Vue globale'!A70=\"\",\"\",'Vue globale'!A70)","v":"Gestion RH"}]
[{"$f":"IF('Vue globale'!A71=\"\",\"\",'Vue globale'!A71)","v":"Cahiers des charges"}]
[{"$f":"IF('Vue globale'!A72=\"\",\"\",'Vue globale'!A72)","v":"Management"}]
[{"$f":"IF('Vue globale'!A73=\"\",\"\",'Vue globale'!A73)","v":"Leadership"}]
[{"$f":"IF('Vue globale'!A74=\"\",\"\",'Vue globale'!A74)","v":"Participation"}]
[{"$f":"IF('Vue globale'!A75=\"\",\"\",'Vue globale'!A75)","v":"Gestion de conflits"}]
[{"$f":"IF('Vue globale'!A76=\"\",\"\",'Vue globale'!A76)","v":""}]
[{"$f":"IF('Vue globale'!A77=\"\",\"\",'Vue globale'!A77)","v":""}]
[{"$f":"IF('Vue globale'!A78=\"\",\"\",'Vue globale'!A78)","v":""}]
[{"$f":"IF('Vue globale'!A79=\"\",\"\",'Vue globale'!A79)","v":""}]
[{"$f":"IF('Vue globale'!A80=\"\",\"\",'Vue globale'!A80)","v":""}]
[{"$f":"IF('Vue globale'!A81=\"\",\"\",'Vue globale'!A81)","v":""}]
[{"$f":"IF('Vue globale'!A82=\"\",\"\",'Vue globale'!A82)","v":""}]
[{"$f":"IF('Vue globale'!A83=\"\",\"\",'Vue globale'!A83)","v":""}]
[{"$f":"IF('Vue globale'!A84=\"\",\"\",'Vue globale'!A84)","v":""}]
[{"$f":"IF('Vue globale'!A85=\"\",\"\",'Vue globale'!A85)","v":""}]
[{"$f":"IF('Vue globale'!A86=\"\",\"\",'Vue globale'!A86)","v":""}]
[{"$f":"IF('Vue globale'!A87=\"\",\"\",'Vue globale'!A87)","v":""}]
[{"$f":"IF('Vue globale'!A88=\"\",\"\",'Vue globale'!A88)","v":""}]
[{"$f":"IF('Vue globale'!A89=\"\",\"\",'Vue globale'!A89)","v":""}]
[{"$f":"IF('Vue globale'!A90=\"\",\"\",'Vue globale'!A90)","v":""}]
[{"$f":"IF('Vue globale'!A91=\"\",\"\",'Vue globale'!A91)","v":""}]
[{"$f":"IF('Vue globale'!A92=\"\",\"\",'Vue globale'!A92)","v":""}]
[{"$f":"IF('Vue globale'!A93=\"\",\"\",'Vue globale'!A93)","v":""}]
[{"$f":"IF('Vue globale'!A94=\"\",\"\",'Vue globale'!A94)","v":""}]
[{"$f":"IF('Vue globale'!A95=\"\",\"\",'Vue globale'!A95)","v":""}]
[{"$f":"IF('Vue globale'!A96=\"\",\"\",'Vue globale'!A96)","v":""}]
[{"$f":"IF('Vue globale'!A97=\"\",\"\",'Vue globale'!A97)","v":""}]
[{"$f":"IF('Vue globale'!A98=\"\",\"\",'Vue globale'!A98)","v":""}]
[{"$f":"IF('Vue globale'!A99=\"\",\"\",'Vue globale'!A99)","v":""}]
[{"$f":"IF('Vue globale'!A100=\"\",\"\",'Vue globale'!A100)","v":""}]
[{"$f":"IF('Vue globale'!A101=\"\",\"\",'Vue globale'!A101)","v":"Fin"}]
[{"$f":"IF('Vue globale'!A102=\"\",\"\",'Vue globale'!A102)","v":""}]

{"sheet":"P9","index":10,"n_rows":103,"n_cols":2,"rows_kept":103,"cut":false,"hidden":false,"merged":[[0,0,0,3]]}
["Instructions :\n - Informe ton nom. Il sera repris pour la vue globale ;\n - Pour chacune des activités (compétence) ci-dessous, choisis dans quel quadrant CPT tu la placerais ;\n - Les lignes des titres des blocs d'activités sont optionnelles."]
["Nom de la personne :","P9"]
["Activités","Quadrant CPT"]
[{"$f":"IF('Vue globale'!A3=\"\",\"\",'Vue globale'!A3)","v":"1. Conception et modélisation d’opportunités entrepreneuriales"}]
[{"$f":"IF('Vue globale'!A4=\"\",\"\",'Vue globale'!A4)","v":"Connaissance de l’environnement "}]
[{"$f":"IF('Vue globale'!A5=\"\",\"\",'Vue globale'!A5)","v":"Recherche d’opportunités "}]
[{"$f":"IF('Vue globale'!A6=\"\",\"\",'Vue globale'!A6)","v":"Mission et vision "}]
[{"$f":"IF('Vue globale'!A7=\"\",\"\",'Vue globale'!A7)","v":"Business model "}]
[{"$f":"IF('Vue globale'!A8=\"\",\"\",'Vue globale'!A8)","v":"Evaluation commerciale "}]
[{"$f":"IF('Vue globale'!A9=\"\",\"\",'Vue globale'!A9)","v":"Evaluation de mise en œuvre "}]
[{"$f":"IF('Vue globale'!A10=\"\",\"\",'Vue globale'!A10)","v":"Evaluation financière "}]
[{"$f":"IF('Vue globale'!A11=\"\",\"\",'Vue globale'!A11)","v":"2. Gestion de l’information"}]
[{"$f":"IF('Vue globale'!A12=\"\",\"\",'Vue globale'!A12)","v":"Définition des besoins "}]
[{"$f":"IF('Vue globale'!A13=\"\",\"\",'Vue globale'!A13)","v":"Identification de sources "}]
[{"$f":"IF('Vue globale'!A14=\"\",\"\",'Vue globale'!A14)","v":"Veille informationnelle"}]
[{"$f":"IF('Vue globale'!A15=\"\",\"\",'Vue globale'!A15)","v":"Réseautage "}]
[{"$f":"IF('Vue globale'!A16=\"\",\"\",'Vue globale'!A16)","v":"Informatique et internet "}]
[{"$f":"IF('Vue globale'!A17=\"\",\"\",'Vue globale'!A17)","v":"Analyse et synthèse"}]
[{"$f":"IF('Vue globale'!A18=\"\",\"\",'Vue globale'!A18)","v":"Gestion de la connaissance "}]
[{"$f":"IF('Vue globale'!A19=\"\",\"\",'Vue globale'!A19)","v":"3. Marketing"}]
[{"$f":"IF('Vue globale'!A20=\"\",\"\",'Vue globale'!A20)","v":"Analyse d’opportunités "}]
[{"$f":"IF('Vue globale'!A21=\"\",\"\",'Vue globale'!A21)","v":"Etude de marché "}]
[{"$f":"IF('Vue globale'!A22=\"\",\"\",'Vue globale'!A22)","v":"Sélection de marché "}]
[{"$f":"IF('Vue globale'!A23=\"\",\"\",'Vue globale'!A23)","v":"Conception de prestations "}]
[{"$f":"IF('Vue globale'!A24=\"\",\"\",'Vue globale'!A24)","v":"Analyse de concurrence "}]
[{"$f":"IF('Vue globale'!A25=\"\",\"\",'Vue globale'!A25)","v":"Positionnement "}]
[{"$f":"IF('Vue globale'!A26=\"\",\"\",'Vue globale'!A26)","v":"Stratégie marketing"}]
[{"$f":"IF('Vue globale'!A27=\"\",\"\",'Vue globale'!A27)","v":"4. Promotion et ventes"}]
[{"$f":"IF('Vue globale'!A28=\"\",\"\",'Vue globale'!A28)","v":"Stratégie commerciale "}]
[{"$f":"IF('Vue globale'!A29=\"\",\"\",'Vue globale'!A29)","v":"Formulation de l’offre "}]
[{"$f":"IF('Vue globale'!A30=\"\",\"\",'Vue globale'!A30)","v":"Choix des canaux "}]
[{"$f":"IF('Vue globale'!A31=\"\",\"\",'Vue globale'!A31)","v":"Promotion des ventes "}]
[{"$f":"IF('Vue globale'!A32=\"\",\"\",'Vue globale'!A32)","v":"Prospection et acquisition "}]
[{"$f":"IF('Vue globale'!A33=\"\",\"\",'Vue globale'!A33)","v":"Suivi commercial "}]
[{"$f":"IF('Vue globale'!A34=\"\",\"\",'Vue globale'!A34)","v":"Fidélisation "}]
[{"$f":"IF('Vue globale'!A35=\"\",\"\",'Vue globale'!A35)","v":"5. Relations et communication institutionnelles"}]
[{"$f":"IF('Vue globale'!A36=\"\",\"\",'Vue globale'!A36)","v":"Sphère d’influence "}]
[{"$f":"IF('Vue globale'!A37=\"\",\"\",'Vue globale'!A37)","v":"Communication institutionnelle "}]
[{"$f":"IF('Vue globale'!A38=\"\",\"\",'Vue globale'!A38)","v":"Communication dans les médias "}]
[{"$f":"IF('Vue globale'!A39=\"\",\"\",'Vue globale'!A39)","v":"Réseaux sociaux "}]
[{"$f":"IF('Vue globale'!A40=\"\",\"\",'Vue globale'!A40)","v":"Gouvernance externe "}]
[{"$f":"IF('Vue globale'!A41=\"\",\"\",'Vue globale'!A41)","v":"Alliances et partenariats "}]
[{"$f":"IF('Vue globale'!A42=\"\",\"\",'Vue globale'!A42)","v":"6. Stratégie et gestion de projets"}]
[{"$f":"IF('Vue globale'!A43=\"\",\"\",'Vue globale'!A43)","v":"Vision stratégique "}]
[{"$f":"IF('Vue globale'!A44=\"\",\"\",'Vue globale'!A44)","v":"Gestion des risques "}]
[{"$f":"IF('Vue globale'!A45=\"\",\"\",'Vue globale'!A45)","v":"Stratégie de développement "}]
[{"$f":"IF('Vue globale'!A46=\"\",\"\",'Vue globale'!A46)","v":"Fixation d’objectifs "}]
[{"$f":"IF('Vue globale'!A47=\"\",\"\",'Vue globale'!A47)","v":"Mesure de résultats "}]
[{"$f":"IF('Vue globale'!A48=\"\",\"\",'Vue globale'!A48)","v":"Gestion de projets "}]
[{"$f":"IF('Vue globale'!A49=\"\",\"\",'Vue globale'!A49)","v":"Evaluation "}]
[{"$f":"IF('Vue globale'!A50=\"\",\"\",'Vue globale'!A50)","v":"7. organisation, production et logistique"}]
[{"$f":"IF('Vue globale'!A51=\"\",\"\",'Vue globale'!A51)","v":"Administration"}]
[{"$f":"IF('Vue globale'!A52=\"\",\"\",'Vue globale'!A52)","v":"Qualité"}]
[{"$f":"IF('Vue globale'!A53=\"\",\"\",'Vue globale'!A53)","v":"Ressources"}]
[{"$f":"IF('Vue globale'!A54=\"\",\"\",'Vue globale'!A54)","v":"Infrastructure"}]
[{"$f":"IF('Vue globale'!A55=\"\",\"\",'Vue globale'!A55)","v":"Négociation"}]
[{"$f":"IF('Vue globale'!A56=\"\",\"\",'Vue globale'!A56)","v":"Production"}]
[{"$f":"IF('Vue globale'!A57=\"\",\"\",'Vue globale'!A57)","v":"Distribution"}]
[{"$f":"IF('Vue globale'!A58=\"\",\"\",'Vue globale'!A58)","v":"Juridique"}]
[{"$f":"IF('Vue globale'!A59=\"\",\"\",'Vue globale'!A59)","v":"8. Gestion financière et des coûts"}]
[{"$f":"IF('Vue globale'!A60=\"\",\"\",'Vue globale'!A60)","v":"Point mort "}]
[{"$f":"IF('Vue globale'!A61=\"\",\"\",'Vue globale'!A61)","v":"Planification financière "}]
[{"$f":"IF('Vue globale'!A62=\"\",\"\",'Vue globale'!A62)","v":"Budget "}]
[{"$f":"IF('Vue globale'!A63=\"\",\"\",'Vue globale'!A63)","v":"Créanciers et débiteurs "}]
[{"$f":"IF('Vue globale'!A64=\"\",\"\",'Vue globale'!A64)","v":"Trésorerie "}]
[{"$f":"IF('Vue globale'!A65=\"\",\"\",'Vue globale'!A65)","v":"Prise de décision "}]
[{"$f":"IF('Vue globale'!A66=\"\",\"\",'Vue globale'!A66)","v":"Relations financières "}]
[{"$f":"IF('Vue globale'!A67=\"\",\"\",'Vue globale'!A67)","v":"Recherche de fonds et investisseurs"}]
[{"$f":"IF('Vue globale'!A68=\"\",\"\",'Vue globale'!A68)","v":"9. Gestion des RH et gouvernance interne"}]
[{"$f":"IF('Vue globale'!A69=\"\",\"\",'Vue globale'!A69)","v":"Politique RH"}]
[{"$f":"IF('Vue globale'!A70=\"\",\"\",'Vue globale'!A70)","v":"Gestion RH"}]
[{"$f":"IF('Vue globale'!A71=\"\",\"\",'Vue globale'!A71)","v":"Cahiers des charges"}]
[{"$f":"IF('Vue globale'!A72=\"\",\"\",'Vue globale'!A72)","v":"Management"}]
[{"$f":"IF('Vue globale'!A73=\"\",\"\",'Vue globale'!A73)","v":"Leadership"}]
[{"$f":"IF('Vue globale'!A74=\"\",\"\",'Vue globale'!A74)","v":"Participation"}]
[{"$f":"IF('Vue globale'!A75=\"\",\"\",'Vue globale'!A75)","v":"Gestion de conflits"}]
[{"$f":"IF('Vue globale'!A76=\"\",\"\",'Vue globale'!A76)","v":""}]
[{"$f":"IF('Vue globale'!A77=\"\",\"\",'Vue globale'!A77)","v":""}]
[{"$f":"IF('Vue globale'!A78=\"\",\"\",'Vue globale'!A78)","v":""}]
[{"$f":"IF('Vue globale'!A79=\"\",\"\",'Vue globale'!A79)","v":""}]
[{"$f":"IF('Vue globale'!A80=\"\",\"\",'Vue globale'!A80)","v":""}]
[{"$f":"IF('Vue globale'!A81=\"\",\"\",'Vue globale'!A81)","v":""}]
[{"$f":"IF('Vue globale'!A82=\"\",\"\",'Vue globale'!A82)","v":""}]
[{"$f":"IF('Vue globale'!A83=\"\",\"\",'Vue globale'!A83)","v":""}]
[{"$f":"IF('Vue globale'!A84=\"\",\"\",'Vue globale'!A84)","v":""}]
[{"$f":"IF('Vue globale'!A85=\"\",\"\",'Vue globale'!A85)","v":""}]
[{"$f":"IF('Vue globale'!A86=\"\",\"\",'Vue globale'!A86)","v":""}]
[{"$f":"IF('Vue globale'!A87=\"\",\"\",'Vue globale'!A87)","v":""}]
[{"$f":"IF('Vue globale'!A88=\"\",\"\",'Vue globale'!A88)","v":""}]
[{"$f":"IF('Vue globale'!A89=\"\",\"\",'Vue globale'!A89)","v":""}]
[{"$f":"IF('Vue globale'!A90=\"\",\"\",'Vue globale'!A90)","v":""}]
[{"$f":"IF('Vue globale'!A91=\"\",\"\",'Vue globale'!A91)","v":""}]
[{"$f":"IF('Vue globale'!A92=\"\",\"\",'Vue globale'!A92)","v":""}]
[{"$f":"IF('Vue globale'!A93=\"\",\"\",'Vue globale'!A93)","v":""}]
[{"$f":"IF('Vue globale'!A94=\"\",\"\",'Vue globale'!A94)","v":""}]
[{"$f":"IF('Vue globale'!A95=\"\",\"\",'Vue globale'!A95)","v":""}]
[{"$f":"IF('Vue globale'!A96=\"\",\"\",'Vue globale'!A96)","v":""}]
[{"$f":"IF('Vue globale'!A97=\"\",\"\",'Vue globale'!A97)","v":""}]
[{"$f":"IF('Vue globale'!A98=\"\",\"\",'Vue globale'!A98)","v":""}]
[{"$f":"IF('Vue globale'!A99=\"\",\"\",'Vue globale'!A99)","v":""}]
[{"$f":"IF('Vue globale'!A100=\"\",\"\",'Vue globale'!A100)","v":""}]
[{"$f":"IF('Vue globale'!A101=\"\",\"\",'Vue globale'!A101)","v":"Fin"}]
[{"$f":"IF('Vue globale'!A102=\"\",\"\",'Vue globale'!A102)","v":""}]

{"sheet":"P10","index":11,"n_rows":103,"n_cols":2,"rows_kept":103,"cut":false,"hidden":false,"merged":[[0,0,0,3]]}
["Instructions :\n - Informe ton nom. Il sera repris pour la vue globale ;\n - Pour chacune des activités (compétence) ci-dessous, choisis dans quel quadrant CPT tu la placerais ;\n - Les lignes des titres des blocs d'activités sont optionnelles."]
["Nom de la personne :","P10"]
["Activités","Quadrant CPT"]
[{"$f":"IF('Vue globale'!A3=\"\",\"\",'Vue globale'!A3)","v":"1. Conception et modélisation d’opportunités entrepreneuriales"}]
[{"$f":"IF('Vue globale'!A4=\"\",\"\",'Vue globale'!A4)","v":"Connaissance de l’environnement "}]
[{"$f":"IF('Vue globale'!A5=\"\",\"\",'Vue globale'!A5)","v":"Recherche d’opportunités "}]
[{"$f":"IF('Vue globale'!A6=\"\",\"\",'Vue globale'!A6)","v":"Mission et vision "}]
[{"$f":"IF('Vue globale'!A7=\"\",\"\",'Vue globale'!A7)","v":"Business model "}]
[{"$f":"IF('Vue globale'!A8=\"\",\"\",'Vue globale'!A8)","v":"Evaluation commerciale "}]
[{"$f":"IF('Vue globale'!A9=\"\",\"\",'Vue globale'!A9)","v":"Evaluation de mise en œuvre "}]
[{"$f":"IF('Vue globale'!A10=\"\",\"\",'Vue globale'!A10)","v":"Evaluation financière "}]
[{"$f":"IF('Vue globale'!A11=\"\",\"\",'Vue globale'!A11)","v":"2. Gestion de l’information"}]
[{"$f":"IF('Vue globale'!A12=\"\",\"\",'Vue globale'!A12)","v":"Définition des besoins "}]
[{"$f":"IF('Vue globale'!A13=\"\",\"\",'Vue globale'!A13)","v":"Identification de sources "}]
[{"$f":"IF('Vue globale'!A14=\"\",\"\",'Vue globale'!A14)","v":"Veille informationnelle"}]
[{"$f":"IF('Vue globale'!A15=\"\",\"\",'Vue globale'!A15)","v":"Réseautage "}]
[{"$f":"IF('Vue globale'!A16=\"\",\"\",'Vue globale'!A16)","v":"Informatique et internet "}]
[{"$f":"IF('Vue globale'!A17=\"\",\"\",'Vue globale'!A17)","v":"Analyse et synthèse"}]
[{"$f":"IF('Vue globale'!A18=\"\",\"\",'Vue globale'!A18)","v":"Gestion de la connaissance "}]
[{"$f":"IF('Vue globale'!A19=\"\",\"\",'Vue globale'!A19)","v":"3. Marketing"}]
[{"$f":"IF('Vue globale'!A20=\"\",\"\",'Vue globale'!A20)","v":"Analyse d’opportunités "}]
[{"$f":"IF('Vue globale'!A21=\"\",\"\",'Vue globale'!A21)","v":"Etude de marché "}]
[{"$f":"IF('Vue globale'!A22=\"\",\"\",'Vue globale'!A22)","v":"Sélection de marché "}]
[{"$f":"IF('Vue globale'!A23=\"\",\"\",'Vue globale'!A23)","v":"Conception de prestations "}]
[{"$f":"IF('Vue globale'!A24=\"\",\"\",'Vue globale'!A24)","v":"Analyse de concurrence "}]
[{"$f":"IF('Vue globale'!A25=\"\",\"\",'Vue globale'!A25)","v":"Positionnement "}]
[{"$f":"IF('Vue globale'!A26=\"\",\"\",'Vue globale'!A26)","v":"Stratégie marketing"}]
[{"$f":"IF('Vue globale'!A27=\"\",\"\",'Vue globale'!A27)","v":"4. Promotion et ventes"}]
[{"$f":"IF('Vue globale'!A28=\"\",\"\",'Vue globale'!A28)","v":"Stratégie commerciale "}]
[{"$f":"IF('Vue globale'!A29=\"\",\"\",'Vue globale'!A29)","v":"Formulation de l’offre "}]
[{"$f":"IF('Vue globale'!A30=\"\",\"\",'Vue globale'!A30)","v":"Choix des canaux "}]
[{"$f":"IF('Vue globale'!A31=\"\",\"\",'Vue globale'!A31)","v":"Promotion des ventes "}]
[{"$f":"IF('Vue globale'!A32=\"\",\"\",'Vue globale'!A32)","v":"Prospection et acquisition "}]
[{"$f":"IF('Vue globale'!A33=\"\",\"\",'Vue globale'!A33)","v":"Suivi commercial "}]
[{"$f":"IF('Vue globale'!A34=\"\",\"\",'Vue globale'!A34)","v":"Fidélisation "}]
[{"$f":"IF('Vue globale'!A35=\"\",\"\",'Vue globale'!A35)","v":"5. Relations et communication institutionnelles"}]
[{"$f":"IF('Vue globale'!A36=\"\",\"\",'Vue globale'!A36)","v":"Sphère d’influence "}]
[{"$f":"IF('Vue globale'!A37=\"\",\"\",'Vue globale'!A37)","v":"Communication institutionnelle "}]
[{"$f":"IF('Vue globale'!A38=\"\",\"\",'Vue globale'!A38)","v":"Communication dans les médias "}]
[{"$f":"IF('Vue globale'!A39=\"\",\"\",'Vue globale'!A39)","v":"Réseaux sociaux "}]
[{"$f":"IF('Vue globale'!A40=\"\",\"\",'Vue globale'!A40)","v":"Gouvernance externe "}]
[{"$f":"IF('Vue globale'!A41=\"\",\"\",'Vue globale'!A41)","v":"Alliances et partenariats "}]
[{"$f":"IF('Vue globale'!A42=\"\",\"\",'Vue globale'!A42)","v":"6. Stratégie et gestion de projets"}]
[{"$f":"IF('Vue globale'!A43=\"\",\"\",'Vue globale'!A43)","v":"Vision stratégique "}]
[{"$f":"IF('Vue globale'!A44=\"\",\"\",'Vue globale'!A44)","v":"Gestion des risques "}]
[{"$f":"IF('Vue globale'!A45=\"\",\"\",'Vue globale'!A45)","v":"Stratégie de développement "}]
[{"$f":"IF('Vue globale'!A46=\"\",\"\",'Vue globale'!A46)","v":"Fixation d’objectifs "}]
[{"$f":"IF('Vue globale'!A47=\"\",\"\",'Vue globale'!A47)","v":"Mesure de résultats "}]
[{"$f":"IF('Vue globale'!A48=\"\",\"\",'Vue globale'!A48)","v":"Gestion de projets "}]
[{"$f":"IF('Vue globale'!A49=\"\",\"\",'Vue globale'!A49)","v":"Evaluation "}]
[{"$f":"IF('Vue globale'!A50=\"\",\"\",'Vue globale'!A50)","v":"7. organisation, production et logistique"}]
[{"$f":"IF('Vue globale'!A51=\"\",\"\",'Vue globale'!A51)","v":"Administration"}]
[{"$f":"IF('Vue globale'!A52=\"\",\"\",'Vue globale'!A52)","v":"Qualité"}]
[{"$f":"IF('Vue globale'!A53=\"\",\"\",'Vue globale'!A53)","v":"Ressources"}]
[{"$f":"IF('Vue globale'!A54=\"\",\"\",'Vue globale'!A54)","v":"Infrastructure"}]
[{"$f":"IF('Vue globale'!A55=\"\",\"\",'Vue globale'!A55)","v":"Négociation"}]
[{"$f":"IF('Vue globale'!A56=\"\",\"\",'Vue globale'!A56)","v":"Production"}]
[{"$f":"IF('Vue globale'!A57=\"\",\"\",'Vue globale'!A57)","v":"Distribution"}]
[{"$f":"IF('Vue globale'!A58=\"\",\"\",'Vue globale'!A58)","v":"Juridique"}]
[{"$f":"IF('Vue globale'!A59=\"\",\"\",'Vue globale'!A59)","v":"8. Gestion financière et des coûts"}]
[{"$f":"IF('Vue globale'!A60=\"\",\"\",'Vue globale'!A60)","v":"Point mort "}]
[{"$f":"IF('Vue globale'!A61=\"\",\"\",'Vue globale'!A61)","v":"Planification financière "}]
[{"$f":"IF('Vue globale'!A62=\"\",\"\",'Vue globale'!A62)","v":"Budget "}]
[{"$f":"IF('Vue globale'!A63=\"\",\"\",'Vue globale'!A63)","v":"Créanciers et débiteurs "}]
[{"$f":"IF('Vue globale'!A64=\"\",\"\",'Vue globale'!A64)","v":"Trésorerie "}]
[{"$f":"IF('Vue globale'!A65=\"\",\"\",'Vue globale'!A65)","v":"Prise de décision "}]
[{"$f":"IF('Vue globale'!A66=\"\",\"\",'Vue globale'!A66)","v":"Relations financières "}]
[{"$f":"IF('Vue globale'!A67=\"\",\"\",'Vue globale'!A67)","v":"Recherche de fonds et investisseurs"}]
[{"$f":"IF('Vue globale'!A68=\"\",\"\",'Vue globale'!A68)","v":"9. Gestion des RH et gouvernance interne"}]
[{"$f":"IF('Vue globale'!A69=\"\",\"\",'Vue globale'!A69)","v":"Politique RH"}]
[{"$f":"IF('Vue globale'!A70=\"\",\"\",'Vue globale'!A70)","v":"Gestion RH"}]
[{"$f":"IF('Vue globale'!A71=\"\",\"\",'Vue globale'!A71)","v":"Cahiers des charges"}]
[{"$f":"IF('Vue globale'!A72=\"\",\"\",'Vue globale'!A72)","v":"Management"}]
[{"$f":"IF('Vue globale'!A73=\"\",\"\",'Vue globale'!A73)","v":"Leadership"}]
[{"$f":"IF('Vue globale'!A74=\"\",\"\",'Vue globale'!A74)","v":"Participation"}]
[{"$f":"IF('Vue globale'!A75=\"\",\"\",'Vue globale'!A75)","v":"Gestion de conflits"}]
[{"$f":"IF('Vue globale'!A76=\"\",\"\",'Vue globale'!A76)","v":""}]
[{"$f":"IF('Vue globale'!A77=\"\",\"\",'Vue globale'!A77)","v":""}]
[{"$f":"IF('Vue globale'!A78=\"\",\"\",'Vue globale'!A78)","v":""}]
[{"$f":"IF('Vue globale'!A79=\"\",\"\",'Vue globale'!A79)","v":""}]
[{"$f":"IF('Vue globale'!A80=\"\",\"\",'Vue globale'!A80)","v":""}]
[{"$f":"IF('Vue globale'!A81=\"\",\"\",'Vue globale'!A81)","v":""}]
[{"$f":"IF('Vue globale'!A82=\"\",\"\",'Vue globale'!A82)","v":""}]
[{"$f":"IF('Vue globale'!A83=\"\",\"\",'Vue globale'!A83)","v":""}]
[{"$f":"IF('Vue globale'!A84=\"\",\"\",'Vue globale'!A84)","v":""}]
[{"$f":"IF('Vue globale'!A85=\"\",\"\",'Vue globale'!A85)","v":""}]
[{"$f":"IF('Vue globale'!A86=\"\",\"\",'Vue globale'!A86)","v":""}]
[{"$f":"IF('Vue globale'!A87=\"\",\"\",'Vue globale'!A87)","v":""}]
[{"$f":"IF('Vue globale'!A88=\"\",\"\",'Vue globale'!A88)","v":""}]
[{"$f":"IF('Vue globale'!A89=\"\",\"\",'Vue globale'!A89)","v":""}]
[{"$f":"IF('Vue globale'!A90=\"\",\"\",'Vue globale'!A90)","v":""}]
[{"$f":"IF('Vue globale'!A91=\"\",\"\",'Vue globale'!A91)","v":""}]
[{"$f":"IF('Vue globale'!A92=\"\",\"\",'Vue globale'!A92)","v":""}]
[{"$f":"IF('Vue globale'!A93=\"\",\"\",'Vue globale'!A93)","v":""}]
[{"$f":"IF('Vue globale'!A94=\"\",\"\",'Vue globale'!A94)","v":""}]
[{"$f":"IF('Vue globale'!A95=\"\",\"\",'Vue globale'!A95)","v":""}]
[{"$f":"IF('Vue globale'!A96=\"\",\"\",'Vue globale'!A96)","v":""}]
[{"$f":"IF('Vue globale'!A97=\"\",\"\",'Vue globale'!A97)","v":""}]
[{"$f":"IF('Vue globale'!A98=\"\",\"\",'Vue globale'!A98)","v":""}]
[{"$f":"IF('Vue globale'!A99=\"\",\"\",'Vue globale'!A99)","v":""}]
[{"$f":"IF('Vue globale'!A100=\"\",\"\",'Vue globale'!A100)","v":""}]
[{"$f":"IF('Vue globale'!A101=\"\",\"\",'Vue globale'!A101)","v":"Fin"}]
[{"$f":"IF('Vue globale'!A102=\"\",\"\",'Vue globale'!A102)","v":""}]

{"sheet":"P11","index":12,"n_rows":103,"n_cols":2,"rows_kept":103,"cut":false,"hidden":false,"merged":[[0,0,0,3]]}
["Instructions :\n - Informe ton nom. Il sera repris pour la vue globale ;\n - Pour chacune des activités (compétence) ci-dessous, choisis dans quel quadrant CPT tu la placerais ;\n - Les lignes des titres des blocs d'activités sont optionnelles."]
["Nom de la personne :","P11"]
["Activités","Quadrant CPT"]
[{"$f":"IF('Vue globale'!A3=\"\",\"\",'Vue globale'!A3)","v":"1. Conception et modélisation d’opportunités entrepreneuriales"}]
[{"$f":"IF('Vue globale'!A4=\"\",\"\",'Vue globale'!A4)","v":"Connaissance de l’environnement "}]
[{"$f":"IF('Vue globale'!A5=\"\",\"\",'Vue globale'!A5)","v":"Recherche d’opportunités "}]
[{"$f":"IF('Vue globale'!A6=\"\",\"\",'Vue globale'!A6)","v":"Mission et vision "}]
[{"$f":"IF('Vue globale'!A7=\"\",\"\",'Vue globale'!A7)","v":"Business model "}]
[{"$f":"IF('Vue globale'!A8=\"\",\"\",'Vue globale'!A8)","v":"Evaluation commerciale "}]
[{"$f":"IF('Vue globale'!A9=\"\",\"\",'Vue globale'!A9)","v":"Evaluation de mise en œuvre "}]
[{"$f":"IF('Vue globale'!A10=\"\",\"\",'Vue globale'!A10)","v":"Evaluation financière "}]
[{"$f":"IF('Vue globale'!A11=\"\",\"\",'Vue globale'!A11)","v":"2. Gestion de l’information"}]
[{"$f":"IF('Vue globale'!A12=\"\",\"\",'Vue globale'!A12)","v":"Définition des besoins "}]
[{"$f":"IF('Vue globale'!A13=\"\",\"\",'Vue globale'!A13)","v":"Identification de sources "}]
[{"$f":"IF('Vue globale'!A14=\"\",\"\",'Vue globale'!A14)","v":"Veille informationnelle"}]
[{"$f":"IF('Vue globale'!A15=\"\",\"\",'Vue globale'!A15)","v":"Réseautage "}]
[{"$f":"IF('Vue globale'!A16=\"\",\"\",'Vue globale'!A16)","v":"Informatique et internet "}]
[{"$f":"IF('Vue globale'!A17=\"\",\"\",'Vue globale'!A17)","v":"Analyse et synthèse"}]
[{"$f":"IF('Vue globale'!A18=\"\",\"\",'Vue globale'!A18)","v":"Gestion de la connaissance "}]
[{"$f":"IF('Vue globale'!A19=\"\",\"\",'Vue globale'!A19)","v":"3. Marketing"}]
[{"$f":"IF('Vue globale'!A20=\"\",\"\",'Vue globale'!A20)","v":"Analyse d’opportunités "}]
[{"$f":"IF('Vue globale'!A21=\"\",\"\",'Vue globale'!A21)","v":"Etude de marché "}]
[{"$f":"IF('Vue globale'!A22=\"\",\"\",'Vue globale'!A22)","v":"Sélection de marché "}]
[{"$f":"IF('Vue globale'!A23=\"\",\"\",'Vue globale'!A23)","v":"Conception de prestations "}]
[{"$f":"IF('Vue globale'!A24=\"\",\"\",'Vue globale'!A24)","v":"Analyse de concurrence "}]
[{"$f":"IF('Vue globale'!A25=\"\",\"\",'Vue globale'!A25)","v":"Positionnement "}]
[{"$f":"IF('Vue globale'!A26=\"\",\"\",'Vue globale'!A26)","v":"Stratégie marketing"}]
[{"$f":"IF('Vue globale'!A27=\"\",\"\",'Vue globale'!A27)","v":"4. Promotion et ventes"}]
[{"$f":"IF('Vue globale'!A28=\"\",\"\",'Vue globale'!A28)","v":"Stratégie commerciale "}]
[{"$f":"IF('Vue globale'!A29=\"\",\"\",'Vue globale'!A29)","v":"Formulation de l’offre "}]
[{"$f":"IF('Vue globale'!A30=\"\",\"\",'Vue globale'!A30)","v":"Choix des canaux "}]
[{"$f":"IF('Vue globale'!A31=\"\",\"\",'Vue globale'!A31)","v":"Promotion des ventes "}]
[{"$f":"IF('Vue globale'!A32=\"\",\"\",'Vue globale'!A32)","v":"Prospection et acquisition "}]
[{"$f":"IF('Vue globale'!A33=\"\",\"\",'Vue globale'!A33)","v":"Suivi commercial "}]
[{"$f":"IF('Vue globale'!A34=\"\",\"\",'Vue globale'!A34)","v":"Fidélisation "}]
[{"$f":"IF('Vue globale'!A35=\"\",\"\",'Vue globale'!A35)","v":"5. Relations et communication institutionnelles"}]
[{"$f":"IF('Vue globale'!A36=\"\",\"\",'Vue globale'!A36)","v":"Sphère d’influence "}]
[{"$f":"IF('Vue globale'!A37=\"\",\"\",'Vue globale'!A37)","v":"Communication institutionnelle "}]
[{"$f":"IF('Vue globale'!A38=\"\",\"\",'Vue globale'!A38)","v":"Communication dans les médias "}]
[{"$f":"IF('Vue globale'!A39=\"\",\"\",'Vue globale'!A39)","v":"Réseaux sociaux "}]
[{"$f":"IF('Vue globale'!A40=\"\",\"\",'Vue globale'!A40)","v":"Gouvernance externe "}]
[{"$f":"IF('Vue globale'!A41=\"\",\"\",'Vue globale'!A41)","v":"Alliances et partenariats "}]
[{"$f":"IF('Vue globale'!A42=\"\",\"\",'Vue globale'!A42)","v":"6. Stratégie et gestion de projets"}]
[{"$f":"IF('Vue globale'!A43=\"\",\"\",'Vue globale'!A43)","v":"Vision stratégique "}]
[{"$f":"IF('Vue globale'!A44=\"\",\"\",'Vue globale'!A44)","v":"Gestion des risques "}]
[{"$f":"IF('Vue globale'!A45=\"\",\"\",'Vue globale'!A45)","v":"Stratégie de développement "}]
[{"$f":"IF('Vue globale'!A46=\"\",\"\",'Vue globale'!A46)","v":"Fixation d’objectifs "}]
[{"$f":"IF('Vue globale'!A47=\"\",\"\",'Vue globale'!A47)","v":"Mesure de résultats "}]
[{"$f":"IF('Vue globale'!A48=\"\",\"\",'Vue globale'!A48)","v":"Gestion de projets "}]
[{"$f":"IF('Vue globale'!A49=\"\",\"\",'Vue globale'!A49)","v":"Evaluation "}]
[{"$f":"IF('Vue globale'!A50=\"\",\"\",'Vue globale'!A50)","v":"7. organisation, production et logistique"}]
[{"$f":"IF('Vue globale'!A51=\"\",\"\",'Vue globale'!A51)","v":"Administration"}]
[{"$f":"IF('Vue globale'!A52=\"\",\"\",'Vue globale'!A52)","v":"Qualité"}]
[{"$f":"IF('Vue globale'!A53=\"\",\"\",'Vue globale'!A53)","v":"Ressources"}]
[{"$f":"IF('Vue globale'!A54=\"\",\"\",'Vue globale'!A54)","v":"Infrastructure"}]
[{"$f":"IF('Vue globale'!A55=\"\",\"\",'Vue globale'!A55)","v":"Négociation"}]
[{"$f":"IF('Vue globale'!A56=\"\",\"\",'Vue globale'!A56)","v":"Production"}]
[{"$f":"IF('Vue globale'!A57=\"\",\"\",'Vue globale'!A57)","v":"Distribution"}]
[{"$f":"IF('Vue globale'!A58=\"\",\"\",'Vue globale'!A58)","v":"Juridique"}]
[{"$f":"IF('Vue globale'!A59=\"\",\"\",'Vue globale'!A59)","v":"8. Gestion financière et des coûts"}]
[{"$f":"IF('Vue globale'!A60=\"\",\"\",'Vue globale'!A60)","v":"Point mort "}]
[{"$f":"IF('Vue globale'!A61=\"\",\"\",'Vue globale'!A61)","v":"Planification financière "}]
[{"$f":"IF('Vue globale'!A62=\"\",\"\",'Vue globale'!A62)","v":"Budget "}]
[{"$f":"IF('Vue globale'!A63=\"\",\"\",'Vue globale'!A63)","v":"Créanciers et débiteurs "}]
[{"$f":"IF('Vue globale'!A64=\"\",\"\",'Vue globale'!A64)","v":"Trésorerie "}]
[{"$f":"IF('Vue globale'!A65=\"\",\"\",'Vue globale'!A65)","v":"Prise de décision "}]
[{"$f":"IF('Vue globale'!A66=\"\",\"\",'Vue globale'!A66)","v":"Relations financières "}]
[{"$f":"IF('Vue globale'!A67=\"\",\"\",'Vue globale'!A67)","v":"Recherche de fonds et investisseurs"}]
[{"$f":"IF('Vue globale'!A68=\"\",\"\",'Vue globale'!A68)","v":"9. Gestion des RH et gouvernance interne"}]
[{"$f":"IF('Vue globale'!A69=\"\",\"\",'Vue globale'!A69)","v":"Politique RH"}]
[{"$f":"IF('Vue globale'!A70=\"\",\"\",'Vue globale'!A70)","v":"Gestion RH"}]
[{"$f":"IF('Vue globale'!A71=\"\",\"\",'Vue globale'!A71)","v":"Cahiers des charges"}]
[{"$f":"IF('Vue globale'!A72=\"\",\"\",'Vue globale'!A72)","v":"Management"}]
[{"$f":"IF('Vue globale'!A73=\"\",\"\",'Vue globale'!A73)","v":"Leadership"}]
[{"$f":"IF('Vue globale'!A74=\"\",\"\",'Vue globale'!A74)","v":"Participation"}]
[{"$f":"IF('Vue globale'!A75=\"\",\"\",'Vue globale'!A75)","v":"Gestion de conflits"}]
[{"$f":"IF('Vue globale'!A76=\"\",\"\",'Vue globale'!A76)","v":""}]
[{"$f":"IF('Vue globale'!A77=\"\",\"\",'Vue globale'!A77)","v":""}]
[{"$f":"IF('Vue globale'!A78=\"\",\"\",'Vue globale'!A78)","v":""}]
[{"$f":"IF('Vue globale'!A79=\"\",\"\",'Vue globale'!A79)","v":""}]
[{"$f":"IF('Vue globale'!A80=\"\",\"\",'Vue globale'!A80)","v":""}]
[{"$f":"IF('Vue globale'!A81=\"\",\"\",'Vue globale'!A81)","v":""}]
[{"$f":"IF('Vue globale'!A82=\"\",\"\",'Vue globale'!A82)","v":""}]
[{"$f":"IF('Vue globale'!A83=\"\",\"\",'Vue globale'!A83)","v":""}]
[{"$f":"IF('Vue globale'!A84=\"\",\"\",'Vue globale'!A84)","v":""}]
[{"$f":"IF('Vue globale'!A85=\"\",\"\",'Vue globale'!A85)","v":""}]
[{"$f":"IF('Vue globale'!A86=\"\",\"\",'Vue globale'!A86)","v":""}]
[{"$f":"IF('Vue globale'!A87=\"\",\"\",'Vue globale'!A87)","v":""}]
[{"$f":"IF('Vue globale'!A88=\"\",\"\",'Vue globale'!A88)","v":""}]
[{"$f":"IF('Vue globale'!A89=\"\",\"\",'Vue globale'!A89)","v":""}]
[{"$f":"IF('Vue globale'!A90=\"\",\"\",'Vue globale'!A90)","v":""}]
[{"$f":"IF('Vue globale'!A91=\"\",\"\",'Vue globale'!A91)","v":""}]
[{"$f":"IF('Vue globale'!A92=\"\",\"\",'Vue globale'!A92)","v":""}]
[{"$f":"IF('Vue globale'!A93=\"\",\"\",'Vue globale'!A93)","v":""}]
[{"$f":"IF('Vue globale'!A94=\"\",\"\",'Vue globale'!A94)","v":""}]
[{"$f":"IF('Vue globale'!A95=\"\",\"\",'Vue globale'!A95)","v":""}]
[{"$f":"IF('Vue globale'!A96=\"\",\"\",'Vue globale'!A96)","v":""}]
[{"$f":"IF('Vue globale'!A97=\"\",\"\",'Vue globale'!A97)","v":""}]
[{"$f":"IF('Vue globale'!A98=\"\",\"\",'Vue globale'!A98)","v":""}]
[{"$f":"IF('Vue globale'!A99=\"\",\"\",'Vue globale'!A99)","v":""}]
[{"$f":"IF('Vue globale'!A100=\"\",\"\",'Vue globale'!A100)","v":""}]
[{"$f":"IF('Vue globale'!A101=\"\",\"\",'Vue globale'!A101)","v":"Fin"}]
[{"$f":"IF('Vue globale'!A102=\"\",\"\",'Vue globale'!A102)","v":""}]

{"sheet":"P12","index":13,"n_rows":103,"n_cols":2,"rows_kept":103,"cut":false,"hidden":false,"merged":[[0,0,0,3]]}
["Instructions :\n - Informe ton nom. Il sera repris pour la vue globale ;\n - Pour chacune des activités (compétence) ci-dessous, choisis dans quel quadrant CPT tu la placerais ;\n - Les lignes des titres des blocs d'activités sont optionnelles."]
["Nom de la personne :","P12"]
["Activités","Quadrant CPT"]
[{"$f":"IF('Vue globale'!A3=\"\",\"\",'Vue globale'!A3)","v":"1. Conception et modélisation d’opportunités entrepreneuriales"}]
[{"$f":"IF('Vue globale'!A4=\"\",\"\",'Vue globale'!A4)","v":"Connaissance de l’environnement "}]
[{"$f":"IF('Vue globale'!A5=\"\",\"\",'Vue globale'!A5)","v":"Recherche d’opportunités "}]
[{"$f":"IF('Vue globale'!A6=\"\",\"\",'Vue globale'!A6)","v":"Mission et vision "}]
[{"$f":"IF('Vue globale'!A7=\"\",\"\",'Vue globale'!A7)","v":"Business model "}]
[{"$f":"IF('Vue globale'!A8=\"\",\"\",'Vue globale'!A8)","v":"Evaluation commerciale "}]
[{"$f":"IF('Vue globale'!A9=\"\",\"\",'Vue globale'!A9)","v":"Evaluation de mise en œuvre "}]
[{"$f":"IF('Vue globale'!A10=\"\",\"\",'Vue globale'!A10)","v":"Evaluation financière "}]
[{"$f":"IF('Vue globale'!A11=\"\",\"\",'Vue globale'!A11)","v":"2. Gestion de l’information"}]
[{"$f":"IF('Vue globale'!A12=\"\",\"\",'Vue globale'!A12)","v":"Définition des besoins "}]
[{"$f":"IF('Vue globale'!A13=\"\",\"\",'Vue globale'!A13)","v":"Identification de sources "}]
[{"$f":"IF('Vue globale'!A14=\"\",\"\",'Vue globale'!A14)","v":"Veille informationnelle"}]
[{"$f":"IF('Vue globale'!A15=\"\",\"\",'Vue globale'!A15)","v":"Réseautage "}]
[{"$f":"IF('Vue globale'!A16=\"\",\"\",'Vue globale'!A16)","v":"Informatique et internet "}]
[{"$f":"IF('Vue globale'!A17=\"\",\"\",'Vue globale'!A17)","v":"Analyse et synthèse"}]
[{"$f":"IF('Vue globale'!A18=\"\",\"\",'Vue globale'!A18)","v":"Gestion de la connaissance "}]
[{"$f":"IF('Vue globale'!A19=\"\",\"\",'Vue globale'!A19)","v":"3. Marketing"}]
[{"$f":"IF('Vue globale'!A20=\"\",\"\",'Vue globale'!A20)","v":"Analyse d’opportunités "}]
[{"$f":"IF('Vue globale'!A21=\"\",\"\",'Vue globale'!A21)","v":"Etude de marché "}]
[{"$f":"IF('Vue globale'!A22=\"\",\"\",'Vue globale'!A22)","v":"Sélection de marché "}]
[{"$f":"IF('Vue globale'!A23=\"\",\"\",'Vue globale'!A23)","v":"Conception de prestations "}]
[{"$f":"IF('Vue globale'!A24=\"\",\"\",'Vue globale'!A24)","v":"Analyse de concurrence "}]
[{"$f":"IF('Vue globale'!A25=\"\",\"\",'Vue globale'!A25)","v":"Positionnement "}]
[{"$f":"IF('Vue globale'!A26=\"\",\"\",'Vue globale'!A26)","v":"Stratégie marketing"}]
[{"$f":"IF('Vue globale'!A27=\"\",\"\",'Vue globale'!A27)","v":"4. Promotion et ventes"}]
[{"$f":"IF('Vue globale'!A28=\"\",\"\",'Vue globale'!A28)","v":"Stratégie commerciale "}]
[{"$f":"IF('Vue globale'!A29=\"\",\"\",'Vue globale'!A29)","v":"Formulation de l’offre "}]
[{"$f":"IF('Vue globale'!A30=\"\",\"\",'Vue globale'!A30)","v":"Choix des canaux "}]
[{"$f":"IF('Vue globale'!A31=\"\",\"\",'Vue globale'!A31)","v":"Promotion des ventes "}]
[{"$f":"IF('Vue globale'!A32=\"\",\"\",'Vue globale'!A32)","v":"Prospection et acquisition "}]
[{"$f":"IF('Vue globale'!A33=\"\",\"\",'Vue globale'!A33)","v":"Suivi commercial "}]
[{"$f":"IF('Vue globale'!A34=\"\",\"\",'Vue globale'!A34)","v":"Fidélisation "}]
[{"$f":"IF('Vue globale'!A35=\"\",\"\",'Vue globale'!A35)","v":"5. Relations et communication institutionnelles"}]
[{"$f":"IF('Vue globale'!A36=\"\",\"\",'Vue globale'!A36)","v":"Sphère d’influence "}]
[{"$f":"IF('Vue globale'!A37=\"\",\"\",'Vue globale'!A37)","v":"Communication institutionnelle "}]
[{"$f":"IF('Vue globale'!A38=\"\",\"\",'Vue globale'!A38)","v":"Communication dans les médias "}]
[{"$f":"IF('Vue globale'!A39=\"\",\"\",'Vue globale'!A39)","v":"Réseaux sociaux "}]
[{"$f":"IF('Vue globale'!A40=\"\",\"\",'Vue globale'!A40)","v":"Gouvernance externe "}]
[{"$f":"IF('Vue globale'!A41=\"\",\"\",'Vue globale'!A41)","v":"Alliances et partenariats "}]
[{"$f":"IF('Vue globale'!A42=\"\",\"\",'Vue globale'!A42)","v":"6. Stratégie et gestion de projets"}]
[{"$f":"IF('Vue globale'!A43=\"\",\"\",'Vue globale'!A43)","v":"Vision stratégique "}]
[{"$f":"IF('Vue globale'!A44=\"\",\"\",'Vue globale'!A44)","v":"Gestion des risques "}]
[{"$f":"IF('Vue globale'!A45=\"\",\"\",'Vue globale'!A45)","v":"Stratégie de développement "}]
[{"$f":"IF('Vue globale'!A46=\"\",\"\",'Vue globale'!A46)","v":"Fixation d’objectifs "}]
[{"$f":"IF('Vue globale'!A47=\"\",\"\",'Vue globale'!A47)","v":"Mesure de résultats "}]
[{"$f":"IF('Vue globale'!A48=\"\",\"\",'Vue globale'!A48)","v":"Gestion de projets "}]
[{"$f":"IF('Vue globale'!A49=\"\",\"\",'Vue globale'!A49)","v":"Evaluation "}]
[{"$f":"IF('Vue globale'!A50=\"\",\"\",'Vue globale'!A50)","v":"7. organisation, production et logistique"}]
[{"$f":"IF('Vue globale'!A51=\"\",\"\",'Vue globale'!A51)","v":"Administration"}]
[{"$f":"IF('Vue globale'!A52=\"\",\"\",'Vue globale'!A52)","v":"Qualité"}]
[{"$f":"IF('Vue globale'!A53=\"\",\"\",'Vue globale'!A53)","v":"Ressources"}]
[{"$f":"IF('Vue globale'!A54=\"\",\"\",'Vue globale'!A54)","v":"Infrastructure"}]
[{"$f":"IF('Vue globale'!A55=\"\",\"\",'Vue globale'!A55)","v":"Négociation"}]
[{"$f":"IF('Vue globale'!A56=\"\",\"\",'Vue globale'!A56)","v":"Production"}]
[{"$f":"IF('Vue globale'!A57=\"\",\"\",'Vue globale'!A57)","v":"Distribution"}]
[{"$f":"IF('Vue globale'!A58=\"\",\"\",'Vue globale'!A58)","v":"Juridique"}]
[{"$f":"IF('Vue globale'!A59=\"\",\"\",'Vue globale'!A59)","v":"8. Gestion financière et des coûts"}]
[{"$f":"IF('Vue globale'!A60=\"\",\"\",'Vue globale'!A60)","v":"Point mort "}]
[{"$f":"IF('Vue globale'!A61=\"\",\"\",'Vue globale'!A61)","v":"Planification financière "}]
[{"$f":"IF('Vue globale'!A62=\"\",\"\",'Vue globale'!A62)","v":"Budget "}]
[{"$f":"IF('Vue globale'!A63=\"\",\"\",'Vue globale'!A63)","v":"Créanciers et débiteurs "}]
[{"$f":"IF('Vue globale'!A64=\"\",\"\",'Vue globale'!A64)","v":"Trésorerie "}]
[{"$f":"IF('Vue globale'!A65=\"\",\"\",'Vue globale'!A65)","v":"Prise de décision "}]
[{"$f":"IF('Vue globale'!A66=\"\",\"\",'Vue globale'!A66)","v":"Relations financières "}]
[{"$f":"IF('Vue globale'!A67=\"\",\"\",'Vue globale'!A67)","v":"Recherche de fonds et investisseurs"}]
[{"$f":"IF('Vue globale'!A68=\"\",\"\",'Vue globale'!A68)","v":"9. Gestion des RH et gouvernance interne"}]
[{"$f":"IF('Vue globale'!A69=\"\",\"\",'Vue globale'!A69)","v":"Politique RH"}]
[{"$f":"IF('Vue globale'!A70=\"\",\"\",'Vue globale'!A70)","v":"Gestion RH"}]
[{"$f":"IF('Vue globale'!A71=\"\",\"\",'Vue globale'!A71)","v":"Cahiers des charges"}]
[{"$f":"IF('Vue globale'!A72=\"\",\"\",'Vue globale'!A72)","v":"Management"}]
[{"$f":"IF('Vue globale'!A73=\"\",\"\",'Vue globale'!A73)","v":"Leadership"}]
[{"$f":"IF('Vue globale'!A74=\"\",\"\",'Vue globale'!A74)","v":"Participation"}]
[{"$f":"IF('Vue globale'!A75=\"\",\"\",'Vue globale'!A75)","v":"Gestion de conflits"}]
[{"$f":"IF('Vue globale'!A76=\"\",\"\",'Vue globale'!A76)","v":""}]
[{"$f":"IF('Vue globale'!A77=\"\",\"\",'Vue globale'!A77)","v":""}]
[{"$f":"IF('Vue globale'!A78=\"\",\"\",'Vue globale'!A78)","v":""}]
[{"$f":"IF('Vue globale'!A79=\"\",\"\",'Vue globale'!A79)","v":""}]
[{"$f":"IF('Vue globale'!A80=\"\",\"\",'Vue globale'!A80)","v":""}]
[{"$f":"IF('Vue globale'!A81=\"\",\"\",'Vue globale'!A81)","v":""}]
[{"$f":"IF('Vue globale'!A82=\"\",\"\",'Vue globale'!A82)","v":""}]
[{"$f":"IF('Vue globale'!A83=\"\",\"\",'Vue globale'!A83)","v":""}]
[{"$f":"IF('Vue globale'!A84=\"\",\"\",'Vue globale'!A84)","v":""}]
[{"$f":"IF('Vue globale'!A85=\"\",\"\",'Vue globale'!A85)","v":""}]
[{"$f":"IF('Vue globale'!A86=\"\",\"\",'Vue globale'!A86)","v":""}]
[{"$f":"IF('Vue globale'!A87=\"\",\"\",'Vue globale'!A87)","v":""}]
[{"$f":"IF('Vue globale'!A88=\"\",\"\",'Vue globale'!A88)","v":""}]
[{"$f":"IF('Vue globale'!A89=\"\",\"\",'Vue globale'!A89)","v":""}]
[{"$f":"IF('Vue globale'!A90=\"\",\"\",'Vue globale'!A90)","v":""}]
[{"$f":"IF('Vue globale'!A91=\"\",\"\",'Vue globale'!A91)","v":""}]
[{"$f":"IF('Vue globale'!A92=\"\",\"\",'Vue globale'!A92)","v":""}]
[{"$f":"IF('Vue globale'!A93=\"\",\"\",'Vue globale'!A93)","v":""}]
[{"$f":"IF('Vue globale'!A94=\"\",\"\",'Vue globale'!A94)","v":""}]
[{"$f":"IF('Vue globale'!A95=\"\",\"\",'Vue globale'!A95)","v":""}]
[{"$f":"IF('Vue globale'!A96=\"\",\"\",'Vue globale'!A96)","v":""}]
[{"$f":"IF('Vue globale'!A97=\"\",\"\",'Vue globale'!A97)","v":""}]
[{"$f":"IF('Vue globale'!A98=\"\",\"\",'Vue globale'!A98)","v":""}]
[{"$f":"IF('Vue globale'!A99=\"\",\"\",'Vue globale'!A99)","v":""}]
[{"$f":"IF('Vue globale'!A100=\"\",\"\",'Vue globale'!A100)","v":""}]
[{"$f":"IF('Vue globale'!A101=\"\",\"\",'Vue globale'!A101)","v":"Fin"}]
[{"$f":"IF('Vue globale'!A102=\"\",\"\",'Vue globale'!A102)","v":""}]